program: Gaussian 09
title: 000160881
version: EM64L-G09RevD.01
frameworkgroup: C1[X(C21H26O)]
method: RPBEPBE
basis: SDD
operation: Freq
keyword: #pfreq=noraman
keyword: PBEPBE/SDD
title: #p freq=noraman PBEPBE/SDD
converged: YES YES NO NO
title: Mulliken charges:
elementType: O C C C C C C C C C C C C C C C C C C C C C H H H H H H H H H H H H H H H H H H H H H H H H H H
charge: -0.238462 0.142396 0.125378 0.359240 0.378403 -0.135941 -0.752113 -0.723146 -0.723910 -0.750305 -0.724122 -0.723518 -0.633508 -0.598408 0.560411 -0.469231 0.406975 -0.386204 -0.369256 -0.240147 -0.242222 -0.236672 0.223871 0.213036 0.212656 0.202058 0.205772 0.270794 0.269984 0.202053 0.206218 0.224458 0.207343 0.216496 0.202569 0.206898 0.269860 0.273155 0.202459 0.204111 0.256434 0.281033 0.229260 0.235862 0.257548 0.232451 0.232835 0.235147
chargesum: 0.00000
title: Mulliken charges with hydrogens summed into heavy atoms:
elementType: O C C C C C C C C C C C C C C C C C C C C C
charge: -0.238462 0.142396 0.125378 0.359240 0.378403 -0.135941 -0.102550 -0.044522 -0.045655 -0.102008 -0.044795 -0.043793 -0.377074 -0.317375 0.560411 -0.239971 0.406975 -0.150342 -0.111707 -0.007696 -0.009387 -0.001525
polarizability: 4.39338487e+02 -2.71431502e+01 2.40023426e+02 -3.44323670e+00 1.56978531e+01 1.48019702e+02
1716.lowfreq: -6.5186 -3.0924 -0.0004 0.0002 0.0006 8.6694 30.2935 33.8060 46.0393
frequency: 30.2287 33.7300 46.0300 62.8738 70.5036 95.6475 144.5791 151.7791 161.3557 178.4048 202.4030 212.5383 235.7174 240.1823 247.8531 259.5552 265.4186 283.2744 298.3813 311.5011 328.4130 331.4532 342.3224 350.2901 364.9859 378.4916 387.8388 396.1565 406.2085 429.7987 445.4501 495.8425 508.2560 510.5666 564.7060 587.0640 599.8389 614.8645 628.8372 676.1258 697.1248 737.8855 758.4190 792.3273 806.0504 832.5904 840.7623 848.8667 870.8017 886.6206 907.8951 919.8404 922.8495 931.0472 932.9760 937.9450 941.5082 947.4581 948.0677 953.0118 980.1637 987.9682 999.2820 1021.2639 1025.6379 1027.6203 1029.5712 1031.9487 1083.5761 1088.1867 1172.1900 1175.5300 1194.0246 1199.2537 1201.2943 1214.3391 1217.6382 1228.4069 1243.8630 1259.7350 1280.2726 1324.0290 1346.7809 1364.0083 1365.9390 1366.8165 1369.3141 1373.8188 1383.7420 1393.8363 1396.9840 1426.5809 1437.1602 1453.4144 1454.6115 1464.3686 1471.4896 1474.0392 1476.4847 1477.1912 1478.3453 1478.5928 1490.1791 1492.0628 1497.5824 1506.2962 1510.7822 1562.3124 1572.3771 1583.2005 1601.1800 1633.7934 2967.3842 2968.2492 2974.6963 2974.9123 2978.0626 2978.6104 3059.4322 3060.3190 3063.3056 3064.2935 3064.5933 3064.8583 3074.5762 3074.9940 3079.3075 3109.7616 3110.8894 3113.0607 3116.3339 3122.1069 3132.5028 3133.9415 3145.5738 3158.4701 3168.4923 3173.8031
redmass: 3.6539 3.8539 4.1138 3.5683 2.9855 4.1910 3.8062 3.4953 2.8585 2.8585 1.3645 1.1933 3.5139 1.1250 1.3519 1.8127 3.0196 2.8023 2.7350 2.8679 1.0881 1.1013 3.7720 3.5126 2.3238 2.7878 2.6587 2.9758 2.8684 2.8559 3.6139 3.0718 2.9063 3.0452 4.6253 4.3169 4.8956 6.1522 3.3388 5.3376 1.8206 5.0248 1.7618 4.6175 3.4324 5.8570 3.9988 1.3066 1.4457 2.4981 1.5166 1.7506 1.6520 1.6923 1.6593 1.4346 1.5956 1.2222 1.2270 3.2980 1.6032 3.5586 1.3374 1.6009 1.3992 1.9524 1.4002 1.3806 2.4644 1.6321 1.9598 1.2079 1.1347 2.9469 2.9347 2.7758 3.0096 2.3964 1.5668 2.4053 3.3386 1.4806 1.5353 1.5365 1.1892 1.2446 1.2302 1.5783 5.3418 1.2335 1.2140 2.7978 2.3125 1.0489 1.0482 1.4521 1.0638 1.1619 1.0544 1.0517 1.0505 1.8174 1.0512 1.0512 1.8819 1.0609 1.2251 6.4886 6.5077 6.1244 5.9085 6.2512 1.0355 1.0355 1.0364 1.0365 1.0371 1.0371 1.1000 1.1002 1.0996 1.0995 1.0993 1.0993 1.0981 1.0980 1.0875 1.0984 1.0983 1.0978 1.0974 1.0873 1.0869 1.0900 1.0925 1.0953 1.0969 1.0938
irintensity: 0.4472 0.1093 0.9228 0.2308 0.0378 1.3987 0.2224 0.9540 0.0821 0.6538 0.3675 0.1256 0.2324 0.1111 0.6063 1.4033 1.0090 3.1813 1.5852 0.1895 0.1046 0.2212 9.5290 6.1426 0.6745 0.1454 0.5074 0.2737 1.0714 1.3818 0.9584 15.3155 2.7470 11.3976 13.0479 0.2166 1.4047 0.9233 2.5413 2.1854 53.5207 3.5001 49.6214 0.8811 1.0400 9.3136 10.3502 1.5223 2.9963 42.9541 1.3734 0.4027 0.5257 0.4114 18.0858 12.9210 30.7777 0.4152 1.7751 37.2339 1.4342 0.0766 0.1938 20.4506 3.2008 16.9251 1.1073 2.9343 47.6951 8.9711 6.2323 1.1205 7.5048 3.3730 7.2153 0.8470 1.6812 1.4964 30.0537 85.5046 1.8334 28.0489 8.7676 6.7964 10.3375 44.5853 106.6281 17.7435 2.5317 32.1714 32.3309 5.7829 13.0184 0.8992 0.0844 220.7612 4.6953 17.3813 1.2736 3.7172 1.8132 1.1588 5.6092 15.5694 115.0705 30.4288 0.6760 7.2035 12.7828 10.0310 4.0746 17.3649 16.9433 20.0436 0.7229 91.2640 78.7172 41.9408 0.8018 0.1229 37.3543 58.6436 27.9376 40.8323 91.4053 101.9745 10.6114 0.5441 4.5438 14.7110 9.1993 5.5846 1.0129 11.9893 18.7260 31.6072 16.7619 12.1990
temp: 298.150 k
press: 1.00000 atm
elementType: 8 6 6 6 6 6 6 6 6 6 6 6 6 6 6 6 6 6 6 6 6 6 1 1 1 1 1 1 1 1 1 1 1 1 1 1 1 1 1 1 1 1 1 1 1 1 1 1
symmnumber: 1
zpe: 1071346.4 jmol-1
zpe.correction: 0.408054 hartree
zpe.thermalcorrener: 0.430338 hartree
zpe.thermalcorrenthalpy: 0.431283 hartree
zpe.thermalcorrgfe: 0.357708 hartree
zpe.sumelectzpe: -889.418194 hartree
zpe.sumelectthermal: -889.395910 hartree
zpe.sumelectthermalent: -889.394965 hartree
zpe.sumelectthermalfe: -889.468540 hartree
dipole: 4.7806 -1.6041 -0.2076
dipole: 5.0468
quadrupole: -127.1308 -124.7793 -136.7534
quadrupole: 4.0128 -0.0466 3.7185
quadrupole: 2.4237 4.7752 -7.1989 4.0128 -0.0466 3.7185
hfenergy: -889.8262479 hartree
pointgroup: C01 [X(C21H26O1)]
dipole: -1.8425385 -0.719673 0.1721376 debye
polarizability: 435.6918892|37.0466356|239.3428826|-8.9560904|-25.5158175|152.346844 unknown
InChI: InChI=1S/C21H26O/c1-20(2,3)17-13-16(12-15-10-8-7-9-11-15)14-18(19(17)22)21(4,5)6/h7-14H,1-6H3
charge 0 multiplicity 1
48 atoms
O  3.265033 1.209816 -0.274616
C  3.433136 -1.685728 0.064241
C  0.896736 2.908611 -0.144702
C  2.10974 -0.888702 0.068397
C  0.857758 1.366882 -0.058664
C  2.146168 0.598338 -0.107894
C  3.195223 -3.205589 0.268504
C  4.156813 -1.494727 -1.305262
C  4.355942 -1.185329 1.21897
C  -0.52067 3.533362 -0.050979
C  1.751732 3.486255 1.026017
C  1.518816 3.340717 -1.510313
C  0.883378 -1.500327 0.219339
C  -0.327806 0.672932 0.073711
C  -0.383529 -0.77827 0.184362
C  -1.562141 -1.520001 0.293175
C  -2.962301 -1.111235 0.154757
C  -3.958237 -1.889403 0.823349
C  -3.403355 -0.019414 -0.656437
C  -5.324697 -1.562393 0.733081
C  -4.77255 0.298809 -0.754618
C  -5.739418 -0.460492 -0.052865
H  4.170773 -3.724551 0.25976
H  2.710146 -3.423393 1.238864
H  2.579841 -3.6413 -0.541234
H  5.099836 -2.073625 -1.309506
H  3.526149 -1.859928 -2.137678
H  4.393738 -0.433577 -1.4777
H  4.601993 -0.120008 1.090022
H  5.296516 -1.768199 1.219582
H  3.867072 -1.322281 2.201929
H  -0.431389 4.632606 -0.118307
H  -1.175975 3.202374 -0.879207
H  -1.017658 3.297281 0.908851
H  1.769131 4.590679 0.960697
H  1.318981 3.207383 2.00525
H  2.78708 3.115677 0.975895
H  2.548583 2.964229 -1.607361
H  1.536342 4.445326 -1.574818
H  0.917383 2.957156 -2.356085
H  0.825461 -2.587474 0.342055
H  -1.266595 1.223625 0.158536
H  -1.428275 -2.587211 0.529652
H  -3.642824 -2.746441 1.431166
H  -2.67777 0.540784 -1.253324
H  -6.066732 -2.166312 1.266535
H  -5.089967 1.131392 -1.392087
H  -6.802511 -0.208526 -0.13224
