program: Gaussian 09
title: 000160877
version: EM64L-G09RevD.01
frameworkgroup: C1[X(C12H20NO2)]
method: RPBEPBE
basis: SDD
operation: Freq
keyword: #p
keyword: freq=noraman
keyword: PBEPBE/SDD
title: #p freq=noraman PBEPBE/SDD
converged: YES YES NO NO
title: Mulliken charges:
elementType: O O N C C C C C C C C C C C C H H H H H H H H H H H H H H H H H H H H
charge: -0.266853 -0.445795 -0.106100 -0.367135 -0.605219 -0.545400 -0.552892 -0.553181 0.574831 -0.589696 -0.409407 0.213720 -0.325148 0.195896 -0.495638 0.289035 0.279982 0.243444 0.238080 0.269489 0.264362 0.270771 0.268376 0.275253 0.262486 0.274772 0.270805 0.262237 0.220263 0.230608 0.268268 0.367517 0.225906 0.242493 0.253870
chargesum: 1.00000
title: Mulliken charges with hydrogens summed into heavy atoms:
elementType: O O N C C C C C C C C C C C C
charge: -0.266853 -0.078278 -0.106100 0.201883 -0.123695 0.259221 0.253224 0.254633 0.574831 -0.369433 -0.178799 0.213720 -0.056880 0.195896 0.226631
polarizability: 2.10158208e+02 2.35396725e+00 1.37120211e+02 1.13115007e+01 -1.12258314e+00 9.45766121e+01
1716.lowfreq: -15.4338 -4.6706 -0.0009 -0.0004 -0.0004 5.8530 15.7521 32.1752 38.2852
frequency: 13.4968 32.0179 38.2083 56.9313 80.5411 122.0465 167.2537 185.5274 190.3906 221.0356 230.2779 253.0173 259.1529 289.9658 303.5154 324.9355 338.4458 347.8207 376.1857 420.3943 435.3197 441.5157 453.5951 478.3251 551.6642 573.4601 607.2595 700.4304 712.4690 718.3688 756.1811 783.1473 819.7093 830.8012 853.7447 924.5831 934.1491 942.9621 946.2802 960.9969 1022.3684 1042.3701 1044.1375 1077.8216 1103.2670 1108.4658 1109.9248 1142.4344 1154.6350 1174.2842 1175.4464 1217.9465 1239.3295 1245.1998 1254.8833 1281.1455 1288.2247 1298.9291 1317.9837 1364.8272 1397.1668 1417.5841 1422.3973 1422.6981 1442.0416 1444.2381 1453.6517 1457.7315 1459.0555 1463.2677 1465.3365 1466.7073 1475.4339 1485.7403 1486.8103 1498.8664 1510.9840 1590.1777 1613.7743 3000.9025 3004.4749 3022.8672 3024.7442 3026.9316 3030.4567 3061.2425 3095.3843 3102.3157 3116.7272 3121.3849 3138.9468 3139.6566 3144.4784 3144.7323 3145.3039 3153.2270 3156.6904 3174.5764 3581.8696
redmass: 3.0238 3.2480 3.4081 3.6388 1.7255 1.6740 2.1478 2.2107 1.5330 4.4222 2.5763 1.0512 1.1210 2.8704 1.4110 2.3804 2.9410 2.7066 3.2521 3.7681 2.5018 3.0331 3.0280 2.9090 4.8252 5.0695 4.4158 4.7211 4.9351 4.1829 3.6313 1.2157 1.4313 1.7083 2.9161 2.8735 3.2088 1.5504 2.1950 7.8420 1.5112 2.8424 1.1981 2.1132 1.3336 1.2393 1.4962 1.3314 1.2861 1.2552 1.4511 1.7311 2.4315 1.9364 1.6128 1.9563 2.0118 1.5306 1.2494 1.2748 4.1560 2.8126 1.1555 1.1620 1.3257 1.1035 1.0475 1.0574 1.1283 1.0508 1.0426 1.0567 1.0981 1.0553 1.0543 1.0573 2.8885 6.8890 6.4920 1.0587 1.0310 1.0398 1.0487 1.0323 1.0353 1.1035 1.0912 1.1083 1.1024 1.0903 1.1053 1.1057 1.1050 1.1060 1.1051 1.1050 1.1044 1.0945 1.0663
irintensity: 0.5848 4.4647 3.7772 2.0491 0.4056 1.0019 1.7877 0.6493 0.6979 3.6880 4.6402 0.2375 0.5812 2.7370 83.3995 50.8016 10.3940 3.3043 7.8794 4.0693 1.1966 1.2451 12.6207 0.8015 7.0322 7.0601 8.0447 11.8495 3.4382 5.4179 14.0880 3.1001 25.5338 68.1420 66.9295 31.2056 12.9842 10.5246 16.6643 20.7525 1.4606 9.8246 0.0468 109.9635 18.5413 1.3528 3.5882 34.5342 15.9898 4.0145 46.6911 2.1809 163.9873 28.1375 7.9158 22.1156 168.1743 3.0036 2.3163 0.9912 20.8236 34.9850 14.2876 12.6713 1.2313 0.1069 0.1286 21.9082 12.3610 39.6115 0.4677 2.1880 4.7281 56.0427 43.5311 111.8735 110.0737 50.7301 33.0351 30.5313 55.7743 1.0858 10.8987 3.2723 3.5500 6.7891 12.8933 8.6143 29.4588 13.4392 0.7001 0.4781 6.6123 14.5873 10.9604 1.2890 6.6373 1.2839 44.4215
temp: 298.150 k
press: 1.00000 atm
elementType: 8 8 7 6 6 6 6 6 6 6 6 6 6 6 6 1 1 1 1 1 1 1 1 1 1 1 1 1 1 1 1 1 1 1 1
symmnumber: 1
zpe: 793724.2 jmol-1
zpe.correction: 0.302314 hartree
zpe.thermalcorrener: 0.319452 hartree
zpe.thermalcorrenthalpy: 0.320396 hartree
zpe.thermalcorrgfe: 0.255923 hartree
zpe.sumelectzpe: -673.024893 hartree
zpe.sumelectthermal: -673.007754 hartree
zpe.sumelectthermalent: -673.006810 hartree
zpe.sumelectthermalfe: -673.071283 hartree
dipole: -14.5569 2.4139 0.0705
dipole: 14.7558
quadrupole: -8.1013 -73.6397 -86.6510
quadrupole: 5.0731 -5.7948 -0.3001
quadrupole: 48.0294 -17.5090 -30.5203 5.0731 -5.7948 -0.3001
hfenergy: -673.3272066 hartree
pointgroup: C01 [X(C12H20N1O2)]
dipole: 5.7165087 0.962874 0.3113082 debye
polarizability: 207.8330854|-0.8709932|136.9669639|19.8966433|-2.7552477|97.0549815 unknown
InChI: InChI=1S/C12H20NO2/c1-13(2,3)8-7-10-5-6-12(15-4)11(14)9-10/h5-6,9,14H,7-8H2,1-4H3
charge 1 multiplicity 1
35 atoms
O  -3.95909 -0.970605 -0.922093
O  -3.015338 1.798096 -0.728692
N  3.876154 -0.012793 -0.146977
C  2.338274 -0.165273 -0.375546
C  1.434179 0.07837 0.85145
C  4.578251 -0.297318 -1.475247
C  4.214782 1.405778 0.301572
C  4.366479 -1.011946 0.897653
C  -0.012165 -0.154639 0.416706
C  -0.853202 0.933012 0.07995
C  -0.523488 -1.470526 0.295726
C  -2.180467 0.728554 -0.363243
C  -1.846193 -1.680569 -0.135136
C  -2.700268 -0.600023 -0.470497
C  -5.124468 -0.059154 -0.834034
H  2.192064 -1.191422 -0.755337
H  2.081132 0.542302 -1.18354
H  1.690549 -0.617021 1.67163
H  1.55016 1.109984 1.229196
H  4.22237 0.418759 -2.231521
H  5.665921 -0.19025 -1.342211
H  4.340256 -1.323086 -1.795372
H  3.821231 2.11889 -0.438862
H  3.761857 1.598181 1.284164
H  5.30889 1.50705 0.373067
H  3.92271 -0.771392 1.873647
H  4.068416 -2.026302 0.591526
H  5.463725 -0.948979 0.964855
H  -0.479155 1.963419 0.168504
H  0.093563 -2.335292 0.569557
H  -2.265157 -2.687764 -0.215788
H  -2.574661 2.670274 -0.575211
H  -5.237063 0.330813 0.192513
H  -5.98031 -0.698731 -1.094739
H  -5.028039 0.776602 -1.542571
