program: Gaussian 09
title: 000160876
version: EM64L-G09RevD.01
frameworkgroup: C1[X(C20H18NO4)]
method: RPBEPBE
basis: SDD
operation: Freq
keyword: #p
keyword: freq=noraman
keyword: PBEPBE/SDD
title: #p freq=noraman PBEPBE/SDD
converged: YES YES NO NO
title: Mulliken charges:
elementType: O O O O N C C C C C C C C C C C C C C C C C C C C H H H H H H H H H H H H H H H H H H
charge: -0.250099 -0.229586 -0.291106 -0.275236 -0.148769 -0.401224 0.272297 -0.580016 0.240801 0.450288 0.291984 -0.360205 0.475506 -0.440731 -0.520815 -0.590819 0.034729 -0.434142 0.180890 0.230042 0.175808 -0.305624 -0.198963 -0.529023 -0.529669 0.246296 0.282485 0.253477 0.268030 0.294635 0.268244 0.258118 0.276093 0.267723 0.283617 0.268953 0.268797 0.252702 0.231794 0.254995 0.252075 0.238581 0.267069
chargesum: 1.00000
title: Mulliken charges with hydrogens summed into heavy atoms:
elementType: O O O O N C C C C C C C C C C C C C C C C C C C C
charge: -0.250099 -0.229586 -0.291106 -0.275236 -0.148769 0.127556 0.272297 -0.058509 0.240801 0.450288 0.291984 -0.065569 0.475506 -0.172487 -0.262696 -0.314726 0.034729 -0.166418 0.180890 0.230042 0.175808 -0.022007 0.338786 0.210468 0.228055
polarizability: 5.24084042e+02 -1.47216234e+01 2.44675893e+02 7.29062438e-01 6.35518800e-01 1.14274226e+02
1716.lowfreq: -6.3212 -1.7723 -0.0007 -0.0006 0.0002 2.9096 27.9690 43.3468 53.6687
frequency: 27.9478 43.3092 53.6438 84.3691 88.1331 95.3112 114.6955 125.3267 140.7943 156.1969 157.4443 172.4695 190.8507 200.9564 229.8389 250.9961 269.4392 281.2122 305.4102 331.8706 354.5951 384.4510 392.2642 415.4320 422.9741 453.3037 472.3273 482.3224 508.1302 518.0669 534.2658 564.9725 605.5313 614.6125 638.3414 667.1988 678.9036 704.7673 714.7709 722.1752 731.1331 744.1136 746.8558 761.4350 787.2868 806.8923 817.8184 867.0520 888.9960 902.2194 909.0715 914.5912 917.1843 920.7586 943.0906 963.7387 966.7871 992.2252 1019.0780 1044.3324 1059.1821 1061.0653 1108.4104 1112.1980 1119.9412 1120.0986 1126.3437 1145.6523 1149.1843 1158.5476 1175.7881 1199.0641 1209.0452 1225.6922 1240.8494 1252.6732 1273.7512 1292.3666 1299.7967 1330.2807 1341.7310 1349.6049 1362.4368 1372.8713 1390.2362 1405.0834 1414.4297 1431.1942 1452.4382 1455.3883 1458.1970 1459.5532 1462.4883 1466.7021 1471.5642 1476.0197 1482.1062 1486.2383 1503.3203 1513.9951 1549.3452 1570.5516 1597.5994 1617.8380 1642.9087 2984.7053 2990.4292 2997.2431 3016.1008 3045.7206 3073.0943 3083.3781 3100.1837 3101.1252 3138.0084 3139.7132 3147.6945 3156.8895 3159.9882 3163.6176 3179.2919 3181.7533 3191.3963
redmass: 4.8596 4.3304 3.7624 2.5392 3.9685 5.2581 2.0943 3.8440 1.3141 2.5627 1.3028 5.3599 4.5965 4.2264 4.8609 3.9388 4.9771 6.1239 3.3609 4.9224 4.9959 5.0865 4.0542 5.2176 4.2549 4.8119 4.3118 3.7285 3.8999 4.9474 4.5186 4.4386 5.5513 6.3085 4.6211 5.6250 9.1844 4.9295 5.6469 5.7739 4.8038 4.7758 3.3130 4.2501 5.9919 10.5640 1.3888 5.1132 1.6684 1.5724 1.5125 1.6786 1.9220 4.4255 6.3424 1.3840 4.7117 2.4817 4.1843 2.8460 1.4455 2.3252 1.4580 1.2401 1.0396 1.9630 5.2693 1.5549 1.3688 1.6593 2.2431 1.2633 1.6972 1.5123 2.2426 1.2938 2.5050 3.3226 1.6925 2.3142 1.3561 2.6685 2.6478 2.0782 2.1660 2.5190 3.3730 1.2075 1.5514 1.1610 1.6229 1.0966 1.1280 1.9224 1.0916 2.1523 1.2918 1.0562 3.9682 4.0556 8.1218 6.7139 6.8292 7.1387 7.8022 1.0306 1.0671 1.0305 1.0622 1.0538 1.0959 1.1053 1.1033 1.1043 1.1206 1.1031 1.1047 1.0921 1.0922 1.0907 1.0924 1.0938 1.0968
irintensity: 0.2296 0.0890 2.1015 12.3243 5.4919 1.0562 7.3245 9.0174 1.6072 1.7031 3.2369 0.8358 4.7604 0.6769 10.4224 5.1949 13.0030 3.2991 3.3297 1.5043 0.5298 2.2306 5.4727 2.0097 19.8522 25.1455 6.3549 6.1509 3.5690 1.3732 4.1964 4.0187 7.9242 8.1946 6.1017 14.0155 1.3431 2.7996 0.2702 3.7941 2.5796 29.3678 1.7664 0.0748 11.6739 14.0205 27.0663 9.6347 7.2986 10.8236 22.8128 1.7869 68.3497 47.0585 20.9788 4.7167 205.5654 10.6597 82.1541 29.7947 4.4284 22.5557 79.8408 37.8891 0.0918 18.9389 43.5604 1.1653 4.7388 27.8681 32.5193 2.2568 23.5911 84.2413 262.6911 58.6507 132.0991 86.6516 85.5984 236.1504 12.2823 496.1044 5.1408 36.7636 12.5881 7.3369 94.0521 7.1311 16.1189 25.0079 11.5303 12.7249 2.1441 18.3796 21.9721 35.0014 14.5992 34.3883 230.4964 43.9827 16.1923 12.4773 327.6859 30.0770 10.2096 54.4944 11.7271 75.9729 9.6035 75.8299 8.0310 22.0783 8.5093 15.5634 10.6570 13.4115 11.6578 2.1523 0.3350 0.6651 1.0027 6.3502 0.0786
temp: 298.150 k
press: 1.00000 atm
elementType: 8 8 8 8 7 6 6 6 6 6 6 6 6 6 6 6 6 6 6 6 6 6 6 6 6 1 1 1 1 1 1 1 1 1 1 1 1 1 1 1 1 1 1
symmnumber: 1
zpe: 885585.8 jmol-1
zpe.correction: 0.337302 hartree
zpe.thermalcorrener: 0.358612 hartree
zpe.thermalcorrenthalpy: 0.359556 hartree
zpe.thermalcorrgfe: 0.287015 hartree
zpe.sumelectzpe: -1126.551530 hartree
zpe.sumelectthermal: -1126.530220 hartree
zpe.sumelectthermalent: -1126.529276 hartree
zpe.sumelectthermalfe: -1126.601816 hartree
dipole: -3.4112 -2.0886 0.0344
dipole: 4.0000
quadrupole: -48.9356 -109.2035 -142.8049
quadrupole: 7.7900 1.2763 -4.6179
quadrupole: 51.3791 -8.8888 -42.4902 7.7900 1.2763 -4.6179
hfenergy: -1126.8888314 hartree
pointgroup: C01 [X(C20H18N1O4)]
dipole: 1.3221403 -0.8531531 0.0249298 debye
polarizability: 524.6268414|8.0626637|243.7788078|-0.3097096|-6.8179017|114.6285126 unknown
InChI: InChI=1S/C20H18NO4/c1-22-18-8-13-5-6-21-10-15-12(3-4-17-20(15)25-11-24-17)7-16(21)14(13)9-19(18)23-2/h3-4,7-10H,5-6,11H2,1-2H3
charge 1 multiplicity 1
43 atoms
O  5.054508 -1.388368 -0.100948
O  6.299682 0.66979 -0.072452
O  -4.417556 2.057615 -0.540155
O  -5.768541 -0.471581 0.224414
N  0.646371 -1.412753 -0.058608
C  -0.135182 -2.695783 -0.14969
C  -0.06685 -0.188562 -0.018893
C  -1.353989 -2.644672 0.780114
C  -1.538163 -0.240052 0.016966
C  -2.203536 -1.436598 0.428081
C  2.785332 -0.289222 -0.056318
C  2.004717 -1.462595 -0.071746
C  2.109245 1.008306 -0.022386
C  0.687044 0.995389 0.005154
C  -2.317816 0.906687 -0.294401
C  -3.606695 -1.469772 0.485248
C  4.201047 -0.278839 -0.070146
C  2.87975 2.214066 -0.002133
C  -3.720335 0.881473 -0.213143
C  -4.384987 -0.33897 0.140806
C  4.919183 0.91938 -0.053306
C  4.284937 2.182978 -0.018989
C  6.447497 -0.815334 -0.105306
C  -5.203259 2.657279 0.573753
C  -6.579387 -0.067823 -0.960311
H  0.544632 -3.523412 0.108008
H  -0.459634 -2.810875 -1.20069
H  -1.02256 -2.60036 1.836561
H  -1.927472 -3.579787 0.662037
H  2.468438 -2.451559 -0.10144
H  0.154243 1.946715 0.070161
H  -1.864661 1.849128 -0.616322
H  -4.138071 -2.382637 0.772918
H  2.362536 3.177601 0.026075
H  4.878588 3.100314 -0.005285
H  6.948025 -1.110556 -1.040604
H  6.969592 -1.149113 0.80486
H  -5.734551 3.508602 0.12512
H  -4.517893 3.011481 1.36498
H  -5.921039 1.93098 0.994648
H  -7.620018 -0.075867 -0.607441
H  -6.443327 -0.819036 -1.758246
H  -6.290648 0.931345 -1.325544
