program: Gaussian 09
title: 000160826
version: EM64L-G09RevD.01
frameworkgroup: C1[X(C20H14N2O3S)]
method: RPBEPBE
basis: SDD
operation: Freq
keyword: #p
keyword: freq=noraman
keyword: PBEPBE/SDD
title: #p freq=noraman PBEPBE/SDD
converged: YES YES NO NO
title: Mulliken charges:
elementType: S O O O N N C C C C C C C C C C C C C C C C C C C C H H H H H H H H H H H H H H
charge: 0.987374 -0.567437 -0.502610 -0.502540 -0.112866 -0.107089 0.395919 0.423326 -0.075134 -0.402383 -0.389544 -0.475958 -0.396862 0.193967 -0.245093 0.164331 0.436375 -0.365843 0.020678 -0.362736 -0.438107 -0.419142 -0.308552 -0.216363 -0.233545 -0.235532 0.293312 0.255875 0.280742 0.251605 0.283545 0.258810 0.268496 0.243682 0.241358 0.278104 0.233260 0.231499 0.232392 0.382686
chargesum: 0.00000
title: Mulliken charges with hydrogens summed into heavy atoms:
elementType: S O O O N N C C C C C C C C C C C C C C C C C C C C
charge: 0.987374 -0.184751 -0.502610 -0.502540 -0.112866 -0.107089 0.395919 0.423326 -0.075134 -0.109071 -0.133668 -0.195216 -0.145258 0.193967 0.038452 0.164331 0.436375 -0.107032 0.020678 -0.094241 -0.194425 -0.177785 -0.030448 0.016897 -0.002046 -0.003139
polarizability: 6.62968422e+02 3.61901734e+00 3.05754541e+02 -9.70788829e-01 -1.41807705e+00 1.16940049e+02
1716.lowfreq: -6.4292 -0.0021 -0.0006 -0.0001 1.8004 4.6159 5.8591 22.7056 31.3223
frequency: -3.0501 22.6909 31.3151 34.9391 59.7770 93.9664 100.1455 140.5427 149.8390 160.4798 165.1234 182.9635 186.3349 193.7602 232.6248 249.5476 261.5530 279.2703 311.6527 322.1345 377.1323 383.4774 405.8183 409.6305 431.2282 435.8236 469.6897 479.4044 480.8279 492.5288 511.0045 528.4911 543.2494 555.3135 560.7968 584.0895 635.0242 641.6139 646.2459 684.6797 717.3101 753.1458 772.5854 782.2428 782.8186 789.2284 812.2645 827.1391 829.6665 836.5535 840.8089 873.1443 894.5115 913.1572 928.3177 936.5694 944.5733 963.9051 970.6220 977.2050 983.2843 990.5363 997.6633 1004.5758 1014.5943 1031.9959 1046.4070 1057.6541 1080.1211 1112.8606 1141.6467 1149.7327 1156.4659 1167.4589 1181.6262 1201.9028 1227.9588 1238.7932 1254.9941 1267.6665 1275.3910 1326.3524 1343.7758 1372.6943 1398.1520 1406.2600 1418.0456 1419.5250 1428.9827 1439.6532 1443.5064 1448.5681 1510.7628 1515.1297 1565.4734 1571.2925 1583.4773 1595.6849 1621.2521 1629.7856 3125.8438 3128.3124 3138.4466 3141.7402 3144.6722 3149.2598 3150.2407 3156.8061 3159.5024 3169.5085 3170.6122 3173.1404 3178.2546 3480.6407
redmass: 5.0940 7.6366 6.0175 6.8784 5.6653 6.2996 8.1782 7.3020 7.0796 4.3400 2.4401 4.1506 2.9670 3.7808 6.7818 8.1717 3.4775 5.3940 7.0057 8.2247 6.2484 5.7841 3.2112 8.2013 3.4423 5.0397 3.2655 2.7203 6.1520 7.3445 6.8549 7.3728 6.0208 4.5200 6.1861 3.9943 7.0113 6.8828 3.3941 3.3633 6.5975 1.3904 4.9420 5.0505 2.5619 1.7578 6.9583 1.4473 1.5776 9.4134 1.4731 5.3647 1.7087 5.4492 1.5542 1.5168 1.4067 6.0391 5.8281 1.3878 1.4240 1.3763 1.3826 1.3441 3.5567 2.5824 1.2902 1.9835 1.9967 1.8868 1.4603 1.3017 1.4196 1.1338 1.2165 2.1923 1.6722 1.7953 1.9829 1.8017 2.1458 2.1048 5.1249 2.3264 3.5034 4.9481 5.0423 4.3761 9.8234 2.5852 2.2340 2.3728 4.4600 3.9578 6.9030 6.4913 5.9509 7.1407 6.9273 6.6930 1.0867 1.0871 1.0904 1.0888 1.0893 1.0925 1.0930 1.0910 1.0968 1.0969 1.0962 1.0968 1.0964 1.0661
irintensity: 0.2117 0.3156 1.3847 0.0558 0.9213 0.0915 0.4181 2.3572 3.9682 6.2509 34.5732 4.1535 10.6632 5.1929 7.0314 9.5100 52.1595 3.7321 24.3449 11.2314 8.0453 0.9590 1.3130 106.1628 4.0808 9.2955 0.3448 19.1384 35.6700 3.5404 0.5780 96.5816 77.0979 68.6226 3.2123 49.3342 21.7864 1.8896 7.0155 9.4193 1.7518 1.7953 0.8135 0.4137 1.3781 91.0248 13.7576 48.1598 24.3238 83.9957 37.0210 1.0328 3.7871 3.5895 28.4680 31.8630 1.6398 43.6429 46.4665 1.7276 3.8056 1.4709 3.3315 0.3090 4.5600 14.4269 53.7255 101.3674 5.5200 1.3484 15.4285 4.0811 5.5484 6.5834 13.8525 140.5738 0.8352 9.3143 7.6631 9.7041 12.6816 28.6391 105.6792 9.4551 22.2065 3.2343 33.9157 7.5010 7.1663 7.3772 8.6817 1.1149 14.7908 33.0712 1.7946 21.4963 26.0299 3.5335 8.7812 3.3200 0.9046 1.1112 13.9985 4.5575 4.6688 2.9299 26.9982 0.7952 38.2313 8.3934 18.8389 3.4259 13.5960 48.4652
temp: 298.150 k
press: 1.00000 atm
elementType: 16 8 8 8 7 7 6 6 6 6 6 6 6 6 6 6 6 6 6 6 6 6 6 6 6 6 1 1 1 1 1 1 1 1 1 1 1 1 1 1
symmnumber: 1
zpe: 757650.0 jmol-1
zpe.correction: 0.288574 hartree
zpe.thermalcorrener: 0.309740 hartree
zpe.thermalcorrenthalpy: 0.310684 hartree
zpe.thermalcorrgfe: 0.237460 hartree
zpe.sumelectzpe: -1501.787256 hartree
zpe.sumelectthermal: -1501.766090 hartree
zpe.sumelectthermalent: -1501.765145 hartree
zpe.sumelectthermalfe: -1501.838370 hartree
dipole: -6.4628 -0.0778 1.3356
dipole: 6.5998
quadrupole: -158.8390 -140.5849 -167.1316
quadrupole: -1.7175 14.0828 1.6107
quadrupole: -3.3205 14.9336 -11.6131 -1.7175 14.0828 1.6107
hfenergy: -1502.0758296 hartree
pointgroup: C01 [X(C20H14N2O3S1)]
dipole: -2.551314 0.0114414 -0.4825824 debye
polarizability: 662.8799964|1.4877924|305.6198107|-8.1346487|4.6204517|117.1632047 unknown
InChI: InChI=1S/C20H14N2O3S/c23-26(24,25)18-11-9-15-12-17(10-8-16(15)13-18)21-22-20-7-3-5-14-4-1-2-6-19(14)20/h1-13,23H
charge 0 multiplicity 1
40 atoms
S  6.760186 -0.399762 -0.005976
O  6.936678 -0.591479 -1.847701
O  7.419925 1.009586 0.437228
O  7.231875 -1.783418 0.689021
N  -1.344454 1.519014 0.058081
N  -2.075223 0.430717 0.041802
C  2.912846 1.116677 0.006196
C  2.104982 -0.092133 0.024177
C  4.895392 -0.268393 -0.008055
C  4.339135 1.00257 -0.013643
C  2.757702 -1.373901 0.032157
C  0.684673 0.019388 0.040871
C  2.260203 2.394283 0.005713
C  -4.308863 -0.544194 0.037511
C  4.147617 -1.477396 0.013955
C  0.0689 1.284765 0.038418
C  -5.749978 -0.389893 0.07162
C  0.871194 2.476572 0.022085
C  -3.484094 0.648041 0.072725
C  -3.756732 -1.863785 -0.029824
C  -6.313996 0.924447 0.137686
C  -6.581093 -1.559528 0.037924
C  -4.080709 1.925698 0.137969
C  -5.4921 2.059936 0.170128
C  -4.592604 -2.983546 -0.061584
C  -6.015469 -2.833442 -0.027324
H  4.975355 1.894351 -0.019294
H  2.143796 -2.280975 0.051178
H  0.055505 -0.87632 0.057031
H  2.870101 3.304129 -0.006926
H  4.659578 -2.443623 0.0326
H  0.351343 3.439543 0.022951
H  -2.669235 -1.968323 -0.055785
H  -7.405015 1.031755 0.162868
H  -7.669951 -1.434246 0.064104
H  -3.427865 2.803298 0.163962
H  -5.939425 3.058252 0.221297
H  -4.158474 -3.988126 -0.113102
H  -6.655864 -3.721662 -0.052715
H  7.904459 -0.763879 -2.039928
