program: Gaussian 09
title: 000160793
version: EM64L-G09RevD.01
frameworkgroup: C1[X(C8H5ClN2)]
method: RPBEPBE
basis: SDD
operation: Freq
keyword: #p
keyword: freq=noraman
keyword: PBEPBE/SDD
title: #p freq=noraman PBEPBE/SDD
converged: NO NO NO NO
title: Mulliken charges:
elementType: Cl N N C C C C C C C C H H H H H
charge: -0.010066 -0.003214 -0.038920 0.387012 0.341412 -0.329060 -0.367036 -0.212390 -0.216550 -0.376194 -0.431645 0.263897 0.247047 0.241580 0.241603 0.262524
chargesum: 0.00000
title: Mulliken charges with hydrogens summed into heavy atoms:
elementType: Cl N N C C C C C C C C
charge: -0.010066 -0.003214 -0.038920 0.387012 0.341412 -0.065164 -0.119990 0.029190 0.025053 -0.376194 -0.169121
polarizability: 1.44527706e+02 3.04389490e+00 1.30549038e+02 -8.26494817e-03 7.86668926e-03 4.10852487e+01
1716.lowfreq: -5.2581 -0.0016 0.0019 0.0031 5.0213 15.2664 101.1172 167.2011 201.8157
frequency: 101.0358 167.1783 201.8148 222.5769 368.6414 404.0247 410.0074 440.2624 503.6982 515.3886 552.6234 639.2992 665.3556 769.9359 770.8491 782.1982 835.2249 880.8344 912.6086 925.4751 957.5638 979.9834 1008.6855 1021.3525 1137.3906 1175.7987 1227.4094 1241.1240 1261.6976 1264.2795 1362.7033 1399.9225 1407.6571 1466.7809 1508.8454 1556.9000 1619.8404 3132.9257 3137.9971 3144.2940 3160.3052 3173.3752
redmass: 5.4890 5.6666 9.5120 4.9411 16.0624 3.5913 5.4344 4.7607 9.3792 8.6454 3.8004 4.7804 6.9167 1.7061 7.8319 2.1797 5.7819 1.3342 1.5274 8.0066 7.2567 1.3793 1.3430 2.2806 1.5674 1.1226 2.9338 2.8686 3.1687 1.7327 2.5362 2.1180 8.1578 2.7049 5.0039 6.5005 6.3730 1.0869 1.0917 1.0900 1.0954 1.0997
irintensity: 0.5433 1.7233 0.4297 1.3571 7.2262 0.0231 0.1635 0.0112 3.3731 7.2543 22.5515 0.1391 15.7245 35.0342 5.9855 38.5752 17.9921 10.5198 14.7437 3.4177 36.6584 4.1763 0.0182 3.2493 0.7792 3.3200 98.2447 55.5204 27.8092 1.9023 7.5483 0.8806 16.6440 14.0448 18.1388 9.1369 2.0434 0.1083 5.2516 9.9024 11.5422 13.7966
temp: 298.150 k
press: 1.00000 atm
elementType: 17 7 7 6 6 6 6 6 6 6 6 1 1 1 1 1
symmnumber: 1
zpe: 289591.2 jmol-1
zpe.correction: 0.110299 hartree
zpe.thermalcorrener: 0.118445 hartree
zpe.thermalcorrenthalpy: 0.119389 hartree
zpe.thermalcorrgfe: 0.076665 hartree
zpe.sumelectzpe: -876.625484 hartree
zpe.sumelectthermal: -876.617338 hartree
zpe.sumelectthermalent: -876.616394 hartree
zpe.sumelectthermalfe: -876.659119 hartree
dipole: -6.1916 -2.5092 0.0004
dipole: 6.6807
quadrupole: -68.5731 -68.8585 -72.3112
quadrupole: -6.3054 -0.0007 0.0007
quadrupole: 1.3412 1.0557 -2.3969 -6.3054 -0.0007 0.0007
hfenergy: -876.7357833 hartree
pointgroup: C01 [X(C8H5Cl1N2)]
dipole: 2.6284047 -0.0042544 0.0001502 debye
dipolederiv: -0.2171852 0.2135581 -0.0000395 0.3517396 -0.8013542 0.0001267 -0.0000628 0.000123 -0.0721665 -0.1875859 -0.4329785 0.0000672 0.2392656 -0.6072692 0.0000768 -0.0000029 0.0000504 -0.178491 -0.1456768 0.1658915 -0.0000254 -0.1709972 0.060732 -0.0000541 -0.0000096 -0.0000406 -0.235045 -0.1246673 0.18833 -0.0000297 0.3640897 -0.2701265 0.0000676 -0.0000425 0.0000603 0.0938639 0.0661085 0.0631671 -0.0000175 -0.2058679 -0.1194859 0.0000156 0.0000055 0.0000407 0.0964508 -0.1503021 -0.1316355 0.0000086 -0.0193738 0.0455182 -0.0000106 0.0000031 -0.0000154 -0.1369571 -0.124368 -0.061185 0.0000057 -0.1104239 0.1067225 -0.0000333 0.0000135 -0.0000386 -0.1541075 0.0432349 0.1667759 -0.000011 0.0962483 0.0823603 -0.0000123 -0.0000047 -0.000019 -0.1290745 0.1647466 -0.0921803 0.0000117 -0.0486672 -0.0236906 -0.0000084 0.0000087 -0.0000085 -0.1330348 0.4698393 -0.1711676 0.0000489 -0.6655054 1.3259056 -0.0002214 0.0001031 -0.0002071 0.0717916 0.081749 -0.0429853 0.0000131 0.1271539 0.2207569 -0.0000267 0.0000148 -0.0000462 -0.0055164 0.0963054 0.060311 -0.0000053 0.0038611 0.0036329 0.0000095 -0.0000068 0.0000207 0.1616276 0.0713815 0.0091095 -0.0000027 0.0638799 -0.0681318 0.0000253 -0.0000051 0.0000299 0.1602641 -0.0072111 -0.0901547 0.0000036 -0.0964605 -0.0016159 0.00001 0.0000058 0.0000096 0.1590047 -0.0959028 0.0470606 -0.0000099 0.0414207 0.0882551 0.0000067 -0.0000119 0.0000078 0.1617109 0.059534 0.1080834 -0.0000178 0.0296371 -0.0422094 0.0000286 -0.0000083 0.000033 0.1396793 unknown
polarizability: 144.6661571|-2.7038424|130.4105872|0.0046884|-0.0104026|41.0852487 unknown
InChI: InChI=1S/C8H5ClN2/c9-8-7-4-2-1-3-6(7)5-10-11-8/h1-5H
charge 0 multiplicity 1
16 atoms
Cl -2.040775 2.396252 -0.000489
N  -2.353883 -0.267018 -0.000133
N  -1.956936 -1.619776 0.000093
C  0.011341 0.474097 -0.00006
C  0.412463 -0.915462 0.000087
C  1.006667 1.49799 -0.000091
C  1.803866 -1.24524 0.000133
C  2.360359 1.146744 -0.000048
C  2.76205 -0.227601 0.000067
C  -1.415488 0.679818 -0.000176
C  -0.636125 -1.899669 0.000173
H  0.689954 2.545423 -0.000174
H  2.101611 -2.300155 0.000248
H  3.12672 1.929448 -0.000099
H  3.828966 -0.475558 0.000113
H  -0.39969 -2.970192 0.000356
