program: Gaussian 09
title: 000013222
version: EM64L-G09RevD.01
frameworkgroup: C1[X(C10H12O2)]
method: RPBEPBE
basis: SDD
operation: Freq
keyword: #pfreq=noraman
keyword: PBEPBE/SDD
title: #p freq=noraman PBEPBE/SDD
converged: YES YES NO NO
title: Mulliken charges:
elementType: O O C C C C C C C C C C H H H H H H H H H H H H
charge: -0.429372 -0.207897 0.060707 0.471136 -0.699355 -0.756026 0.142687 -0.353650 -0.410865 -0.258413 -0.242918 -0.240541 0.225849 0.224994 0.241963 0.231160 0.253131 0.220424 0.232034 0.241839 0.224560 0.223061 0.227770 0.377722
chargesum: 0.00000
title: Mulliken charges with hydrogens summed into heavy atoms:
elementType: O O C C C C C C C C C C
charge: -0.051649 -0.207897 0.060707 0.471136 -0.006549 -0.051312 0.142687 -0.121616 -0.169026 -0.033853 -0.019857 -0.012771
polarizability: 1.39821105e+02 -4.16885504e+00 1.06907223e+02 -6.63696171e+00 -8.45422577e+00 7.60989078e+01
1716.lowfreq: -8.7446 -0.0011 -0.0010 -0.0006 4.8177 12.3995 28.8495 48.5644 106.4474
frequency: 28.8124 48.4062 106.4465 182.3876 216.8742 248.5396 269.4257 297.3950 318.8542 326.8119 356.5661 393.4168 404.3833 501.8718 573.0824 581.0176 590.5344 617.7953 684.3305 703.8280 727.3570 767.2755 803.7240 848.0096 908.5804 930.0236 943.2878 972.7879 991.1889 993.7185 1011.5606 1015.9722 1029.5831 1083.3944 1113.2569 1138.1417 1173.3160 1177.6399 1200.9942 1259.2043 1282.2684 1325.1251 1374.5588 1380.3340 1398.0270 1434.3385 1463.4289 1470.1228 1484.3995 1487.7513 1493.2794 1592.6331 1615.3812 1652.4796 2991.0708 2993.2797 3086.4712 3091.6499 3105.1632 3109.9473 3122.2117 3130.2025 3143.8783 3156.4432 3167.8489 3517.4499
redmass: 7.3212 4.4696 4.5663 3.9168 1.4707 1.8053 2.9018 1.1484 3.4792 2.5176 4.2853 3.8896 2.7979 3.5616 3.8348 3.4502 1.2129 6.3894 4.8887 1.6330 5.1971 2.0973 2.5481 1.2503 1.6876 1.8408 1.5400 1.3962 2.7180 1.7812 1.5025 2.2420 2.4816 1.8001 2.1162 2.9223 1.1860 1.5843 1.1170 2.4953 2.7770 1.3396 1.3194 4.4559 1.1988 2.2064 1.0789 1.0525 1.0674 1.8591 1.1270 5.9802 6.0660 9.2198 1.0352 1.0350 1.1008 1.1000 1.1007 1.0998 1.0844 1.0879 1.0934 1.0957 1.0991 1.0641
irintensity: 0.2898 0.0880 1.8169 0.9047 0.1176 0.1425 0.1178 0.1864 2.5900 1.7537 5.3479 2.5199 0.0287 2.2976 19.1308 38.2440 122.9963 0.8266 3.9042 55.6983 21.4800 32.9579 8.6238 0.0489 1.3210 15.9271 2.4354 0.1813 0.8723 2.7335 68.1410 277.4803 4.4307 8.5816 1.7142 2.3347 1.6101 5.8912 0.4444 17.3913 5.9620 0.8322 16.3583 1.2411 7.1569 11.2496 2.4158 8.4786 12.4122 13.1651 30.4096 1.0494 2.2183 213.7075 21.9909 15.4056 16.7998 27.5788 1.4502 43.7032 1.7823 4.1961 34.3469 36.2440 10.6466 23.7280
temp: 298.150 k
press: 1.00000 atm
elementType: 8 8 6 6 6 6 6 6 6 6 6 6 1 1 1 1 1 1 1 1 1 1 1 1
symmnumber: 1
zpe: 512058.8 jmol-1
zpe.correction: 0.195033 hartree
zpe.thermalcorrener: 0.206602 hartree
zpe.thermalcorrenthalpy: 0.207546 hartree
zpe.thermalcorrgfe: 0.157102 hartree
zpe.sumelectzpe: -537.826373 hartree
zpe.sumelectthermal: -537.814804 hartree
zpe.sumelectthermalent: -537.813860 hartree
zpe.sumelectthermalfe: -537.864304 hartree
dipole: -0.8318 1.1908 0.9524
dipole: 1.7369
quadrupole: -61.5435 -68.5691 -74.3152
quadrupole: 1.6405 0.4455 -5.1941
quadrupole: 6.5991 -0.4265 -6.1726 1.6405 0.4455 -5.1941
hfenergy: -538.0214062 hartree
pointgroup: C01 [X(C10H12O2)]
dipole: -0.3187101 0.4833978 0.3629383 debye
dipolederiv: -1.3469808 0.0810938 0.1652283 -0.024491 -0.3047398 0.0482215 0.1072916 0.0564775 -0.3806254 -0.7070384 -0.0642497 0.0118356 0.1795364 -0.7077482 -0.3430596 0.1237977 -0.3110635 -0.4725735 0.1737174 -0.0451041 0.010859 -0.1309586 -0.1027649 -0.1054142 0.0562801 -0.0957864 0.0444769 0.2775647 -0.0355585 -0.0500316 -0.0658735 -0.0752128 -0.0008517 -0.047041 0.0063304 -0.0802913 -0.1014943 -0.0070347 0.0158689 -0.0004202 0.035116 0.0003934 -0.0054887 0.0380312 0.0170677 -0.0728478 -0.0031282 -0.0343991 0.0325111 0.0107241 0.0285194 -0.0342691 -0.0153202 0.0191056 1.5417597 0.0783556 -0.1382586 0.0261587 0.8649309 0.5325684 -0.1885871 0.4753217 0.4472934 -0.0558251 0.1047605 -0.0305216 0.1454388 -0.0013021 -0.0676466 0.0045622 -0.0325341 -0.086732 -0.1341337 -0.0363398 0.0172886 -0.0271444 0.0116995 -0.069017 0.0107452 -0.0754775 -0.1084214 -0.0336667 -0.0665878 -0.0009104 -0.0705524 0.0769881 -0.0927032 0.0004634 -0.0854144 -0.1156717 0.0065011 0.0677163 -0.0508221 0.07915 0.0123038 -0.0893269 -0.0669124 -0.0845558 -0.1008988 0.0738562 -0.0316923 -0.0166498 -0.0325942 -0.080252 -0.0287471 -0.0199617 -0.0359072 -0.1498672 0.1009695 0.0572477 -0.0398351 0.046134 -0.0688655 0.1156865 -0.039474 0.06151 0.0137105 0.0520528 -0.1037671 -0.0522328 -0.0985067 -0.0437429 -0.0861347 -0.0550802 -0.0480559 0.0303796 -0.1371886 0.0560764 0.0683117 0.0602269 0.0990902 -0.0143881 0.0633791 -0.0033669 0.0693663 0.1041723 -0.0142706 0.0663077 0.0115272 0.0653241 -0.0031731 0.0456711 0.0190176 -0.1314597 -0.1225267 0.0698624 0.0099417 0.0292605 0.1075429 0.0117625 0.0387167 -0.0102038 0.0955522 0.0621277 -0.1114589 -0.0487986 -0.097218 -0.0681803 -0.0551284 -0.0585783 -0.054874 0.0407157 0.0041216 -0.0874729 0.0623766 -0.0928446 0.026666 0.0623083 0.0621013 0.0541704 0.0888028 0.0970718 0.067318 -0.0237398 0.0721128 -0.0478589 0.0777535 -0.0244014 0.0717767 0.1014393 0.0438996 0.0679663 -0.0163842 0.0846681 -0.0670056 0.0899877 -0.0225014 0.0892044 0.1169623 -0.0146886 -0.0783108 0.0616831 -0.0967621 -0.0036358 0.0885855 0.0680432 0.0853987 0.1062813 -0.1356956 0.0466249 0.0209837 0.0483579 0.0936309 0.02438 0.0213856 0.0239255 0.1466323 0.3242718 -0.0120466 -0.0081011 -0.0777164 0.1672923 -0.124576 -0.0401418 -0.1286046 0.2887549 unknown
polarizability: 139.5785052|-4.7929909|106.4057808|-7.3100167|-9.3257202|76.8429494 unknown
InChI: InChI=1S/C10H12O2/c1-10(2,9(11)12)8-6-4-3-5-7-8/h3-7,11H,1-2H3
charge 0 multiplicity 1
24 atoms
O  -3.309613 -0.462683 -0.07151
O  -1.548278 -1.615184 -1.024198
C  -1.10057 0.505849 0.25671
C  0.404784 0.209564 0.091225
C  -1.433871 0.631394 1.780416
C  -1.552497 1.816012 -0.454861
C  -1.938972 -0.6409 -0.347945
C  0.939542 -1.013512 0.577805
C  1.299543 1.148536 -0.477974
C  2.320505 -1.286421 0.502326
C  2.686548 0.879681 -0.554855
C  3.20446 -0.33761 -0.063584
H  -1.17192 -0.28998 2.328695
H  -0.843309 1.460373 2.20896
H  -2.507137 0.835356 1.928347
H  -1.328277 1.794057 -1.536164
H  -2.637836 1.955868 -0.325789
H  -1.037826 2.684632 -0.007389
H  0.270561 -1.770723 1.00187
H  0.926686 2.098638 -0.87216
H  2.707047 -2.240412 0.878357
H  3.35817 1.622072 -1.001081
H  4.27818 -0.548047 -0.123444
H  -3.81742 -1.204561 -0.498758
