program: Gaussian 09
title: 000160784
version: EM64L-G09RevD.01
frameworkgroup: C1[X(C9H18NO4)]
method: RPBEPBE
basis: SDD
operation: Freq
keyword: #p
keyword: freq=noraman
keyword: PBEPBE/SDD
title: #p freq=noraman PBEPBE/SDD
converged: YES YES NO NO
title: Mulliken charges:
elementType: O O O O N C C C C C C C C C H H H H H H H H H H H H H H H H H H
charge: -0.273343 -0.212378 -0.401155 -0.234143 -0.113802 -0.356728 -0.547081 -0.535360 -0.550763 -0.288117 0.276988 -0.516898 -0.477747 0.204022 0.282799 0.283696 0.273692 0.266295 0.273173 0.272027 0.267179 0.272447 0.274187 0.275134 0.266336 0.251760 0.253671 0.295686 0.268264 0.270641 0.286252 0.393265
chargesum: 1.00000
title: Mulliken charges with hydrogens summed into heavy atoms:
elementType: O O O O N C C C C C C C C C
charge: -0.273343 -0.212378 -0.007889 -0.234143 -0.113802 0.209767 0.266078 0.276293 0.264894 0.217314 0.276988 0.047053 0.079146 0.204022
polarizability: 1.56115267e+02 -1.40052297e+00 1.04771783e+02 -5.06076736e-01 1.30139545e+00 8.78036115e+01
1716.lowfreq: -8.9972 -1.5133 -0.0004 -0.0002 0.0007 6.7828 17.2184 20.6799 34.2981
frequency: 15.9364 19.4602 34.2754 41.2833 54.8510 74.5218 85.0736 137.8180 167.8193 188.0977 189.0605 234.6583 254.0625 269.2368 275.7905 341.0647 345.4128 386.3341 432.0680 448.5824 470.1543 507.3549 527.1150 554.7387 586.6324 651.8326 670.7994 734.6845 794.0888 798.1777 832.6627 887.3459 909.4507 921.2923 940.2450 970.5363 1019.7427 1043.9470 1051.4513 1054.8949 1072.3288 1079.3947 1102.4535 1121.0749 1135.0111 1165.4478 1188.2498 1216.7886 1243.6473 1249.4597 1252.3168 1259.4258 1306.6805 1324.1524 1335.7146 1382.9082 1391.0788 1423.6352 1424.0783 1440.2455 1448.4298 1450.2782 1452.7930 1461.5618 1464.0377 1471.6139 1485.3794 1485.8944 1488.8029 1501.1513 1659.6543 1671.6703 2989.0542 3009.9882 3013.4641 3025.7539 3028.5621 3031.4145 3037.5825 3060.6524 3071.1905 3085.3458 3114.3513 3143.7423 3144.7312 3146.3936 3150.0560 3152.3505 3156.3798 3518.4156
redmass: 4.4536 3.8873 6.3790 4.9370 3.5897 1.7889 2.6353 3.8457 2.8348 1.3039 4.4276 4.0309 1.1167 1.0898 4.3816 2.2283 3.6276 3.4744 2.2874 2.8606 2.8756 2.2315 2.5375 3.5112 4.2031 1.3747 5.3536 4.3814 1.5906 1.2383 5.9573 3.3903 3.9846 2.6955 3.1523 5.5517 2.1894 1.1960 4.7212 1.2928 2.1660 2.5024 2.3127 1.6997 1.4294 1.2176 1.2750 1.7815 1.2345 1.3608 1.9381 1.3743 1.2895 1.4549 1.5420 1.7646 1.5178 1.1549 1.1471 1.0753 1.0933 1.0920 1.0471 1.1019 1.0452 1.0661 1.0531 1.0681 1.0619 1.0580 8.7202 9.8264 1.0662 1.0567 1.0642 1.0323 1.0322 1.0345 1.0572 1.0925 1.1077 1.0974 1.1085 1.1056 1.1060 1.1053 1.1055 1.1059 1.1052 1.0643
irintensity: 1.0847 0.2914 2.5822 1.4106 1.4106 0.1444 0.3057 9.2154 8.2892 0.9809 2.1476 8.3697 0.1832 0.2637 5.4171 0.0609 1.6100 8.6760 0.0314 12.5602 16.9212 28.8394 5.6181 56.3217 18.7064 134.9883 1.3917 2.1742 22.6082 0.7827 34.0027 80.5562 28.8140 14.7050 50.2928 68.8913 24.9957 0.0270 14.4380 0.0112 102.3903 465.1349 15.2562 1.7715 0.0754 0.8027 0.5529 0.5022 58.3268 1.0777 0.1053 3.8059 1.7020 62.5033 105.1680 13.2891 2.2488 15.3742 19.3944 13.0816 2.2248 67.3566 1.1040 5.5734 1.7593 2.5129 42.6108 56.4664 12.8666 82.1669 265.9466 94.0906 30.4918 22.7622 9.7997 1.7913 1.9589 2.8021 2.9222 2.1734 10.3737 3.8117 5.2275 0.1308 0.3584 2.9119 7.9807 1.7696 5.7573 45.8888
temp: 298.150 k
press: 1.00000 atm
elementType: 8 8 8 8 7 6 6 6 6 6 6 6 6 6 1 1 1 1 1 1 1 1 1 1 1 1 1 1 1 1 1 1
symmnumber: 1
zpe: 711522.9 jmol-1
zpe.correction: 0.271005 hartree
zpe.thermalcorrener: 0.288022 hartree
zpe.thermalcorrenthalpy: 0.288966 hartree
zpe.thermalcorrgfe: 0.222648 hartree
zpe.sumelectzpe: -708.020100 hartree
zpe.sumelectthermal: -708.003083 hartree
zpe.sumelectthermalent: -708.002139 hartree
zpe.sumelectthermalfe: -708.068457 hartree
dipole: -16.8301 0.7426 -1.0840
dipole: 16.8813
quadrupole: 16.8549 -85.1358 -76.0736
quadrupole: -4.7204 -2.7775 -0.3337
quadrupole: 64.9731 -37.0177 -27.9554 -4.7204 -2.7775 -0.3337
hfenergy: -708.2911051 hartree
pointgroup: C01 [X(C9H18N1O4)]
dipole: -6.6164432 0.362152 -0.450013 debye
polarizability: 156.138281|-1.0015188|102.7241749|0.3169138|5.6421355|89.8282063 unknown
InChI: InChI=1S/C9H18NO4/c1-10(2,3)6-7-14-9(13)5-4-8(11)12/h11H,4-7H2,1-3H3
charge 1 multiplicity 1
32 atoms
O  -0.27446 0.305725 -0.09647
O  0.832199 -1.732155 0.086034
O  5.815051 -0.20655 -0.267782
O  4.616247 1.266452 1.073444
N  -4.055497 0.137698 -0.001435
C  -2.593471 0.636018 -0.082829
C  -4.319243 -0.563773 1.332608
C  -4.969604 1.362638 -0.106227
C  -4.37224 -0.816665 -1.154571
C  -1.530259 -0.469536 -0.02499
C  0.908577 -0.492797 -0.009194
C  2.136183 0.382071 -0.015339
C  3.424771 -0.412438 -0.293264
C  4.637788 0.323754 0.251012
H  -2.497089 1.196295 -1.028179
H  -2.445967 1.337166 0.755984
H  -4.049674 0.116443 2.154817
H  -5.388133 -0.819083 1.393084
H  -3.718168 -1.481922 1.392605
H  -4.798236 1.858284 -1.073853
H  -6.018107 1.036291 -0.033414
H  -4.735773 2.057116 0.71491
H  -4.112691 -0.328202 -2.106108
H  -3.792996 -1.743511 -1.037882
H  -5.447561 -1.050793 -1.135289
H  -1.547941 -1.053268 0.913127
H  -1.575712 -1.17217 -0.876352
H  2.221816 0.872241 0.97648
H  1.996413 1.207192 -0.735346
H  3.57248 -0.611936 -1.368053
H  3.380476 -1.403875 0.197468
H  6.604422 0.257488 0.124105
