program: Gaussian 09
title: 000160767
version: EM64L-G09RevD.01
frameworkgroup: C1[X(C15H12O2)]
method: RPBEPBE
basis: SDD
operation: Freq
keyword: #pfreq=noraman
keyword: PBEPBE/SDD
title: #p freq=noraman PBEPBE/SDD
converged: YES YES NO NO
title: Mulliken charges:
elementType: O O C C C C C C C C C C C C C C C H H H H H H H H H H H H
charge: -0.244128 -0.193049 -0.384755 -0.360109 0.074482 0.523895 0.165130 0.217997 -0.444683 -0.368151 -0.356624 -0.369596 -0.249314 -0.197407 -0.225241 -0.242296 -0.241273 0.266509 0.248850 0.223105 0.230983 0.239507 0.276324 0.256699 0.235617 0.234682 0.226732 0.226564 0.229549
chargesum: 0.00000
title: Mulliken charges with hydrogens summed into heavy atoms:
elementType: O O C C C C C C C C C C C C C C C
charge: -0.244128 -0.193049 -0.118246 0.111846 0.074482 0.523895 0.165130 0.217997 -0.213700 -0.128644 -0.080300 -0.112897 -0.013696 0.037275 0.001491 -0.015732 -0.011724
polarizability: 2.49148136e+02 1.94768557e+00 1.40818662e+02 -3.24007992e+00 9.22329802e+00 1.01364926e+02
1716.lowfreq: -8.1309 -4.0511 -0.0009 -0.0008 -0.0003 4.3258 32.4882 35.6724 75.6160
frequency: 32.1464 35.6138 75.6071 114.0362 152.3680 192.4802 240.7826 245.7594 271.8397 294.4658 379.9559 403.7841 433.1252 442.5410 492.1339 521.5061 528.3337 542.7676 591.2773 618.6882 651.6817 664.1653 703.6135 728.8141 758.1771 766.5255 777.4548 814.8935 839.6780 850.9988 878.6116 915.7958 940.2803 963.5954 973.5282 974.8622 991.1866 995.5254 996.2032 1023.5899 1027.5887 1048.1142 1066.9229 1085.7485 1107.1350 1161.4181 1173.5180 1192.2173 1194.3364 1200.2412 1203.7964 1218.3774 1268.1076 1280.3322 1303.7267 1335.4137 1364.7098 1383.6301 1394.4448 1441.6510 1443.7530 1456.7419 1469.3253 1485.8426 1571.8097 1588.5007 1594.7407 1614.6533 1621.6954 2965.7219 2988.4864 3108.3812 3115.6271 3126.8022 3136.7604 3138.3422 3148.6116 3149.5978 3164.5919 3165.3102 3175.2775
redmass: 4.7955 4.9533 4.9186 4.7617 5.0971 3.2591 5.8468 4.9720 3.9913 6.3654 4.1196 2.8007 4.8983 5.1172 4.8284 4.1602 3.6234 6.1720 5.0740 6.3768 5.0547 4.6716 1.7168 4.2033 2.2157 2.0862 1.6837 4.3838 4.2448 1.2614 1.4486 1.4950 3.4905 3.5220 1.4104 1.3995 4.3474 1.4295 1.3471 2.3525 2.1768 2.4949 3.9024 1.6526 1.7698 1.1824 1.0569 1.1154 1.4550 1.4163 1.9870 2.2450 1.8390 1.5185 1.6856 1.2969 1.4440 7.6495 8.4304 2.1774 2.2926 1.9694 1.3293 2.3230 7.2685 8.6662 6.5006 6.2202 7.3624 1.0797 1.0679 1.0993 1.0877 1.0860 1.0861 1.0914 1.0901 1.0961 1.0952 1.1015 1.0998
irintensity: 0.6456 0.8858 0.9070 3.0583 2.4020 3.1258 1.8730 2.0883 3.8171 5.7036 1.9515 0.1237 3.0725 0.4505 7.0575 10.1344 7.3011 17.0374 10.5857 2.3314 3.5465 3.1629 49.4035 3.8623 44.6242 34.0600 59.1390 4.8203 17.7204 0.3876 1.8463 1.8363 4.3746 73.5113 5.9367 0.2644 0.0593 0.2442 0.2379 6.1245 12.6730 6.4491 3.7972 9.4089 43.9870 17.2591 0.0624 0.3780 0.4325 22.0167 37.4847 36.5669 3.6179 128.6031 58.4436 3.3827 28.6479 0.6384 12.8444 8.7093 99.8787 11.0727 50.0680 20.9976 23.6370 185.8116 30.0863 37.5614 60.5406 1.5690 49.2049 14.4729 8.4274 0.7112 4.6345 19.2332 3.2420 39.3461 15.4054 19.8266 18.9514
temp: 298.150 k
press: 1.00000 atm
elementType: 8 8 6 6 6 6 6 6 6 6 6 6 6 6 6 6 6 1 1 1 1 1 1 1 1 1 1 1 1
symmnumber: 1
zpe: 595144.5 jmol-1
zpe.correction: 0.226679 hartree
zpe.thermalcorrener: 0.239915 hartree
zpe.thermalcorrenthalpy: 0.240859 hartree
zpe.thermalcorrgfe: 0.185667 hartree
zpe.sumelectzpe: -728.060954 hartree
zpe.sumelectthermal: -728.047717 hartree
zpe.sumelectthermalent: -728.046773 hartree
zpe.sumelectthermalfe: -728.101965 hartree
dipole: -0.6204 -1.9242 0.6905
dipole: 2.1364
quadrupole: -79.4149 -103.0982 -96.8170
quadrupole: -4.0520 0.1420 4.6262
quadrupole: 13.6951 -9.9882 -3.7070 -4.0520 0.1420 4.6262
hfenergy: -728.2876322 hartree
pointgroup: C01 [X(C15H12O2)]
dipole: 0.2478778 0.7832927 -0.1775266 debye
polarizability: 249.1333691|3.1769321|120.9473401|2.6347521|-21.756449|121.2510139 unknown
InChI: InChI=1S/C15H12O2/c16-15-12-8-4-5-9-14(12)17-10-13(15)11-6-2-1-3-7-11/h1-9,13H,10H2
charge 0 multiplicity 1
29 atoms
O  1.374856 1.756961 -0.777231
O  -0.012611 -1.935805 0.710632
C  -0.526525 0.119236 -0.55926
C  -0.029002 1.568966 -0.337608
C  0.402067 -0.855196 0.203504
C  -2.005963 0.018508 -0.217472
C  1.837096 -0.46055 0.227185
C  2.269829 0.792533 -0.303348
C  -2.975481 0.046488 -1.250593
C  -2.444986 -0.031164 1.130427
C  2.818257 -1.370132 0.711941
C  3.645883 1.110859 -0.378614
C  4.185192 -1.055133 0.654728
C  4.595134 0.187634 0.098493
C  -4.355846 0.028207 -0.948514
C  -3.823174 -0.04907 1.435269
C  -4.783953 -0.016846 0.397752
H  -0.386177 -0.11395 -1.636794
H  -0.610783 2.287249 -0.934595
H  -0.097041 1.841312 0.735479
H  -2.648515 0.075802 -2.297907
H  -1.711167 -0.086708 1.942156
H  2.465135 -2.326092 1.113487
H  3.942523 2.077934 -0.79509
H  4.932337 -1.762598 1.027785
H  5.660568 0.437852 0.046135
H  -5.092462 0.044745 -1.75951
H  -4.148675 -0.09602 2.480518
H  -5.853316 -0.034123 0.636044
