program: Gaussian 09
title: 000160765
version: EM64L-G09RevD.01
frameworkgroup: C1[X(C4H8O2S)]
method: RPBEPBE
basis: SDD
operation: Freq
keyword: #pfreq=noraman
keyword: PBEPBE/SDD
title: #p freq=noraman PBEPBE/SDD
converged: YES YES NO NO
title: Mulliken charges:
elementType: S O O C C C C H H H H H H H H
charge: 0.453307 -0.387598 -0.312138 -0.660740 -0.804876 -0.778468 0.207735 0.291358 0.271001 0.285020 0.273808 0.277556 0.262217 0.256493 0.365325
chargesum: 0.00000
title: Mulliken charges with hydrogens summed into heavy atoms:
elementType: S O O C C C C
charge: 0.453307 -0.387598 -0.312138 -0.098381 0.031508 0.105567 0.207735
polarizability: 1.09613520e+02 8.54925947e-01 7.10946048e+01 -1.26102516e+00 -1.10184629e+00 4.90389602e+01
1716.lowfreq: -34.2249 -22.8335 -8.1478 -0.0038 -0.0029 -0.0022 43.2835 70.4505 121.8167
frequency: 42.6569 69.9578 121.7758 153.3435 165.8172 176.0743 231.4781 251.6729 339.4037 456.8737 509.7483 580.7609 618.8238 637.9899 808.4436 865.3396 937.9020 956.7567 1007.5501 1049.8927 1087.4356 1162.9962 1205.2434 1311.4844 1340.3834 1369.7971 1418.9073 1439.5108 1443.1594 1473.9103 1598.9471 2993.3891 3021.0432 3027.5723 3129.3246 3130.9994 3150.6120 3156.8969 3158.1970
redmass: 5.7531 3.5705 1.0455 3.1422 2.6109 1.4165 3.0289 2.7821 10.0595 6.5144 2.5239 6.2446 7.5594 7.5487 6.1241 1.9136 1.2145 1.1963 1.2450 1.2857 1.1225 1.1919 11.1124 1.1332 1.1328 1.0915 1.0569 1.0526 1.0510 1.0578 10.4751 1.0286 1.0283 1.0547 1.1055 1.1108 1.1061 1.1066 1.1050
irintensity: 2.9389 3.9991 0.1208 3.9943 1.6671 2.9374 2.0933 1.2027 5.3969 96.8530 1.2629 14.2973 12.2500 7.4074 20.0878 3.9387 0.2384 6.6390 9.3229 43.3518 4.4780 15.5596 127.8762 30.7642 8.9708 16.2669 26.1112 6.1724 19.2417 46.3157 258.0413 36.0707 8.0646 5.0994 7.9539 3.0066 4.2285 4.3061 2.5399
temp: 298.150 k
press: 1.00000 atm
elementType: 16 8 8 6 6 6 6 1 1 1 1 1 1 1 1
symmnumber: 1
zpe: 296686.3 jmol-1
zpe.correction: 0.113002 hartree
zpe.thermalcorrener: 0.122744 hartree
zpe.thermalcorrenthalpy: 0.123689 hartree
zpe.thermalcorrgfe: 0.077560 hartree
zpe.sumelectzpe: -705.097454 hartree
zpe.sumelectthermal: -705.087712 hartree
zpe.sumelectthermalent: -705.086768 hartree
zpe.sumelectthermalfe: -705.132896 hartree
dipole: 11.0529 -1.6080 1.5095
dipole: 11.2708
quadrupole: -62.2422 -48.5184 -49.5186
quadrupole: -0.1679 1.8020 3.8611
quadrupole: -8.8158 4.9080 3.9078 -0.1679 1.8020 3.8611
hfenergy: -705.2104563 hartree
pointgroup: C01 [X(C4H8O2S1)]
dipole: -4.38467 0.3368634 0.5691472 debye
dipolederiv: 0.1149032 0.0017317 -0.1896229 0.0444249 0.1104945 -0.0446363 -0.5124083 -0.0296997 0.1603686 -0.7375168 0.0279242 -0.0118513 0.0246682 -0.5112331 -0.2451139 -0.0707954 -0.2192407 -1.0329015 -1.122742 -0.0069132 -0.3542012 0.1094697 -0.409233 -0.0378091 -0.2380797 -0.0965134 -0.7364689 0.8179906 0.0616954 0.406691 0.0763472 0.0443336 -0.1221076 0.6319462 -0.1555237 0.0528317 -0.259605 0.0213555 -0.0574697 -0.1105928 -0.0416989 -0.000287 -0.0534453 -0.0230639 -0.0348846 -0.1946399 -0.0209411 0.0273244 0.0723837 0.1824801 0.0187088 0.0873031 0.0906766 0.0375669 1.0539805 -0.1206302 0.2098493 -0.2062691 0.2727484 0.342534 0.0806183 0.3951913 1.2112419 0.0391524 0.0111356 -0.0242476 0.0580821 -0.0161164 -0.0279926 -0.0548288 -0.0323505 0.071569 -0.0581193 -0.0309129 0.0289254 -0.0595388 0.0534399 0.0697648 0.0389766 0.0384074 -0.016647 0.0975963 -0.0038014 0.0237395 0.0095341 -0.0225485 -0.0451501 0.036598 -0.0610521 0.0935779 0.039657 0.0453273 0.0081483 0.0161759 0.0337633 0.0957032 0.053659 0.0694149 -0.0094919 -0.1139608 0.0056581 -0.0473466 -0.0277569 0.1242396 -0.0246348 0.0103096 -0.0362273 0.0498371 0.004929 -0.0449273 -0.1163103 -0.0202121 0.0489991 -0.0151611 -0.0777238 -0.0028082 0.0686757 0.1030119 -0.037895 0.016091 -0.0386482 -0.0096811 0.0104147 0.0506084 0.059745 -0.0537568 0.2153631 0.0911933 0.0802808 0.0519319 0.1400123 0.0257671 0.017262 0.0030444 0.1384819 unknown
polarizability: 108.6100788|-5.6245564|57.7299006|5.519178|10.1958551|63.4071058 unknown
InChI: InChI=1S/C4H8O2S/c1-7(2)3-4(5)6/h3H2,1-2H3
charge 0 multiplicity 1
15 atoms
S  -1.274448 0.432115 -0.436787
O  1.384087 -0.52453 -1.046175
O  2.482104 -0.077275 0.997447
C  0.214546 0.451122 0.867487
C  -2.819559 0.674549 0.649952
C  -1.400785 -1.418692 -0.787871
C  1.499061 -0.117464 0.174208
H  0.324233 1.516003 1.131461
H  -0.118321 -0.146201 1.734667
H  -2.819165 1.722998 0.980524
H  -2.776589 -0.009048 1.510923
H  -3.704252 0.47147 0.028503
H  -2.220106 -1.560466 -1.507138
H  -1.58309 -1.956497 0.155204
H  -0.411916 -1.653684 -1.213805
