program: Gaussian 09
title: 000160756
version: EM64L-G09RevD.01
frameworkgroup: C1[X(C11H8O4)]
method: RPBEPBE
basis: SDD
operation: Freq
keyword: #pfreq=noraman
keyword: PBEPBE/SDD
title: #p freq=noraman PBEPBE/SDD
converged: YES YES NO YES
title: Mulliken charges:
elementType: O O O O C C C C C C C C C C C H H H H H H H H
charge: -0.246825 -0.256902 -0.182570 -0.215891 0.421049 0.176172 0.242702 -0.538260 0.246200 -0.491362 -0.253045 -0.302381 0.121466 -0.211846 -0.532129 0.286999 0.282728 0.256094 0.257032 0.215783 0.255528 0.234743 0.234716
chargesum: 0.00000
title: Mulliken charges with hydrogens summed into heavy atoms:
elementType: O O O O C C C C C C C C C C C
charge: -0.246825 -0.256902 -0.182570 -0.215891 0.421049 0.176172 0.242702 -0.251261 0.246200 -0.208634 0.003050 -0.045349 0.121466 0.003937 0.192858
polarizability: 2.40894592e+02 -4.79065430e+00 1.49148005e+02 -1.51812283e-02 -1.40897651e-02 5.54395841e+01
1716.lowfreq: -9.7320 0.0006 0.0009 0.0010 4.1534 7.6070 65.4687 81.5926 114.7672
frequency: 65.4684 81.5793 114.7625 157.5595 159.6556 172.0684 179.3717 209.7483 269.9542 287.6397 338.1517 345.3016 432.3668 435.1129 453.4444 466.5631 467.7298 571.5344 621.2268 646.3753 647.5050 700.6976 711.8533 751.3159 756.8597 832.3660 833.0315 864.6554 874.3218 938.2271 971.9358 988.2872 1002.3398 1032.3603 1105.9800 1111.5731 1149.4369 1160.6151 1189.1262 1226.5570 1257.7099 1286.1567 1364.0184 1371.8219 1414.8499 1428.6248 1440.0042 1469.6117 1469.8725 1492.0986 1547.2686 1579.5277 1606.8784 1633.8208 1698.9982 2970.1352 2977.8998 3074.4371 3138.2410 3141.1418 3142.0515 3186.9059 3190.1687
redmass: 8.6708 3.9370 5.6650 4.8384 7.3836 4.3642 2.7497 1.3984 2.7191 7.3083 4.4475 6.4325 6.4485 4.0045 7.4313 2.8926 7.4444 6.5164 6.4967 4.3839 6.2014 5.3025 8.5018 7.1692 2.7968 1.5149 5.7450 1.7951 4.2998 1.3959 6.8160 1.3937 1.7206 3.3667 3.9022 1.2579 2.0429 1.4320 1.7172 1.5493 1.8720 2.7567 1.7428 2.4275 3.3709 3.2995 1.3384 1.1270 1.0548 2.9972 9.5272 6.9555 6.6059 7.2853 11.0346 1.0871 1.0323 1.1049 1.0920 1.1010 1.0908 1.0916 1.0957
irintensity: 8.8788 2.9474 0.0150 4.8905 8.4203 0.4410 16.7535 0.4167 2.8673 0.3848 0.1307 0.3343 12.8226 0.3345 17.2187 7.8044 31.7258 7.5137 7.1391 0.0236 6.7261 0.9507 39.1619 38.1997 4.6932 49.1271 30.5629 35.7259 9.0416 17.1600 48.8783 0.2005 11.0959 67.5018 239.7399 0.2411 8.0541 37.3050 62.3145 41.1212 27.4752 99.4460 62.8415 29.6889 25.9501 48.6375 7.4984 67.6527 20.4530 26.3861 35.0173 474.9006 67.6125 375.5525 471.2444 67.6685 45.0030 32.8700 1.0438 15.3548 7.2401 0.7113 1.1217
temp: 298.150 k
press: 1.00000 atm
elementType: 8 8 8 8 6 6 6 6 6 6 6 6 6 6 6 1 1 1 1 1 1 1 1
symmnumber: 1
zpe: 431893.2 jmol-1
zpe.correction: 0.164499 hartree
zpe.thermalcorrener: 0.177239 hartree
zpe.thermalcorrenthalpy: 0.178183 hartree
zpe.thermalcorrgfe: 0.125280 hartree
zpe.sumelectzpe: -723.790967 hartree
zpe.sumelectthermal: -723.778228 hartree
zpe.sumelectthermalent: -723.777284 hartree
zpe.sumelectthermalfe: -723.830187 hartree
dipole: 1.9888 1.8472 -0.0005
dipole: 2.7143
quadrupole: -105.6264 -80.4262 -86.7773
quadrupole: 30.5150 -0.0165 -0.0036
quadrupole: -14.6831 10.5171 4.1660 30.5150 -0.0165 -0.0036
hfenergy: -723.9554669 hartree
pointgroup: C01 [X(C11H8O4)]
dipole: 0.8111098 0.6882773 0.0936633 debye
dipolederiv: -1.595875 0.2038417 0.0582878 -0.1086877 -0.3288047 -0.0178872 0.0091421 -0.0239054 -0.2055094 -1.1552888 -0.8407219 -0.1171887 -0.7773419 -1.0486917 -0.1073965 -0.1079092 -0.1065128 -0.296552 -1.3955001 0.3259471 0.0714953 0.730019 -0.6277702 -0.0614075 0.1358864 -0.0540139 -0.336251 -0.6462446 0.1849158 0.0351817 0.7305405 -0.9934133 -0.1175997 0.1214154 -0.1071663 -0.355869 -0.8036953 0.0760686 0.0266014 -0.0745819 -0.4847743 -0.0722516 0.0029176 -0.0750491 -0.0308765 1.0039747 -0.0574418 -0.0244115 -0.0963735 0.5612004 0.066983 -0.0303476 0.0662074 0.1603626 -1.2367516 0.390406 0.0846137 -0.2930067 -0.4293676 -0.0580895 -0.0232985 -0.0710318 -0.039266 0.8495849 -0.1446747 -0.0402063 0.0776539 0.046008 0.0179709 -0.0051303 0.0221837 -0.0735785 1.2335615 0.8213914 0.1096637 0.4348949 0.7361195 0.0927052 0.0492914 0.0859724 0.1155943 -0.835435 -0.2287598 -0.0248419 -0.0132223 -0.0464142 0.0268989 0.008902 0.0306763 -0.2100257 1.0116016 0.0194598 -0.0169425 0.1847981 0.2378105 0.0429632 0.008819 0.0461792 -0.0494234 -0.5533451 0.0904354 0.0208719 0.7230323 -0.335066 -0.0363529 0.1207976 -0.024372 -0.19725 2.1456375 -0.3625985 -0.0924397 -0.769335 0.8970634 0.1110138 -0.1570735 0.1035449 0.3033471 1.4674121 -0.5523595 -0.11339 -0.744438 1.0420878 0.16026 -0.1437491 0.1566526 0.1432311 0.2512744 0.060189 0.01051 0.4546833 0.8074859 0.0708596 0.0731664 0.0783006 0.3181507 0.115487 -0.013508 -0.0015051 -0.0311921 0.0144661 -0.0204789 -0.0043206 -0.0207436 0.144586 0.1012309 0.0074725 0.0026641 -0.0105655 -0.0107859 -0.0304969 -0.0003845 -0.0308857 0.1779691 0.0946865 0.0406369 0.0073031 -0.0383093 -0.0523292 -0.0297627 -0.0052075 -0.0312848 0.136095 -0.0004749 -0.0553305 -0.0052147 -0.0300048 0.0575432 -0.0190328 -0.001176 -0.0185473 0.1791729 -0.1150055 -0.063785 -0.0054173 -0.1668023 -0.0011137 -0.0159435 -0.0218361 -0.0179134 0.1183929 -0.0973401 -0.1007553 -0.0115882 -0.0510219 0.0520499 -0.0113408 -0.0036637 -0.0103174 0.1279888 0.0835101 0.0813631 0.1202839 -0.0750714 -0.0315366 -0.0194808 0.0449375 -0.0676972 -0.0834204 0.0769947 0.1178076 -0.0943306 -0.0556677 -0.0617673 0.0278667 -0.0711787 0.0697237 -0.0468684 unknown
polarizability: 240.2928383|-7.8486108|147.33883|-4.7052547|14.6840062|57.8505133 unknown
InChI: InChI=1S/C11H8O4/c1-14-9-5-10-7(4-8(9)6-12)2-3-11(13)15-10/h2-6H,1H3
charge 0 multiplicity 1
23 atoms
O  -1.914267 1.1136 0.353773
O  2.934691 1.267488 0.290577
O  -4.225756 1.102538 0.396703
O  3.238633 -2.751399 -0.35297
C  -0.652142 -0.967483 0.002165
C  -0.700684 0.445854 0.226231
C  1.811341 -0.826352 -0.021703
C  0.621015 -1.573215 -0.117523
C  1.72288 0.593203 0.205215
C  0.467259 1.226631 0.328491
C  -1.905105 -1.683923 -0.086996
C  -3.11369 -1.033817 0.038516
C  -3.20624 0.40531 0.26678
C  3.122981 -1.508454 -0.154789
C  2.913532 2.720271 0.519996
H  0.715885 -2.652202 -0.289746
H  0.360142 2.299696 0.500568
H  -1.880189 -2.7662 -0.258205
H  -4.067756 -1.562312 -0.026312
H  4.017886 -0.855116 -0.069106
H  3.971034 3.017572 0.546514
H  2.429539 2.959064 1.485081
H  2.395212 3.242746 -0.305158
