program: Gaussian 09
title: 000160751
version: EM64L-G09RevD.01
frameworkgroup: C1[X(C10H12N8O4)]
method: RPBEPBE
basis: SDD
operation: Freq
keyword: #p
keyword: freq=noraman
keyword: PBEPBE/SDD
title: #p freq=noraman PBEPBE/SDD
converged: YES YES NO NO
title: Mulliken charges:
elementType: O O O O N N N N N N N N C C C C C C C C C C H H H H H H H H H H H H
charge: -0.246894 -0.433013 -0.491168 -0.448320 -0.215409 -0.069689 -0.174067 -0.031048 -0.047996 -0.606472 0.010084 -0.013868 -0.159662 -0.051375 -0.177430 -0.076828 -0.350473 0.220928 0.105001 -0.089440 0.162296 -0.321736 0.277725 0.262102 0.244696 0.243111 0.170189 0.214700 0.372908 0.364069 0.411749 0.258368 0.348136 0.338825
chargesum: 0.00000
title: Mulliken charges with hydrogens summed into heavy atoms:
elementType: O O O O N N N N N N N N C C C C C C C C C C
charge: -0.246894 -0.060105 -0.127099 -0.036571 -0.215409 -0.069689 -0.174067 -0.031048 -0.047996 0.080489 0.010084 -0.013868 0.118063 0.210727 0.067266 0.166284 0.034415 0.220928 0.105001 -0.089440 0.162296 -0.063368
polarizability: 2.27488946e+02 -1.07762021e+01 2.56451158e+02 -8.21601242e+00 -9.09525648e+00 9.45634733e+01
1716.lowfreq: -2.8406 -0.0003 0.0003 0.0003 4.8933 7.8850 27.8294 49.7106 61.5348
frequency: 27.6550 49.7014 61.5281 72.4679 88.2336 122.1560 135.2876 141.8271 159.7348 160.1251 193.0228 207.7920 223.8776 237.5761 251.1674 268.8148 291.4406 314.2728 347.0853 365.0515 400.7402 419.1423 433.2760 442.4221 510.1109 529.0271 534.4546 535.9552 551.0270 557.0248 569.4210 574.1470 588.4925 649.1592 654.7820 687.4139 707.9762 716.2956 768.2293 792.8256 801.6262 852.7997 863.3576 870.5588 912.4872 930.2792 950.2586 964.2351 974.2449 988.6312 1028.8221 1036.3912 1046.7859 1055.4228 1065.8668 1067.9367 1148.2733 1184.6869 1203.9199 1216.9383 1235.5748 1239.3653 1247.5850 1257.6333 1275.6221 1290.4705 1299.6555 1309.7517 1322.9238 1344.1825 1351.3402 1360.1856 1371.0437 1382.2194 1390.5037 1425.1298 1452.5669 1455.5628 1480.8737 1509.6238 1543.2120 1585.4371 1636.1017 2086.8034 2897.3139 2988.0836 3010.7553 3026.4310 3030.7658 3050.3885 3075.5758 3172.1955 3481.3954 3538.0788 3610.5967 3692.2746
redmass: 6.9811 6.0577 6.7288 7.1978 8.0083 5.6540 3.2677 6.6044 7.6427 8.8701 2.7889 1.4662 7.4756 4.3405 6.7934 6.8703 5.0887 6.1258 5.6615 6.1800 6.4919 5.3322 8.6680 13.5965 1.3552 2.5496 1.3852 5.0674 1.1654 5.8102 3.8360 4.3049 5.6184 6.5959 9.0151 11.6438 4.8448 9.0524 5.6186 11.0089 3.9218 4.9557 2.4397 1.4454 6.8926 1.4254 2.7785 2.5967 3.4779 3.1431 4.7083 4.4494 2.4526 4.3233 3.1842 4.0245 1.2868 4.5920 1.5646 2.1810 1.8995 2.7796 1.3962 1.3037 1.4352 2.0417 2.4458 3.0401 1.6940 1.8531 2.4478 1.9283 1.2357 1.3171 1.6963 2.7945 3.6705 1.1008 7.5286 1.1383 7.3832 1.8607 2.8689 13.9890 1.0676 1.0744 1.0865 1.0850 1.0857 1.0908 1.0872 1.0927 1.0646 1.0445 1.0670 1.1056
irintensity: 0.3495 3.9832 1.7524 0.7417 3.5496 3.5512 8.0346 1.4319 4.2368 0.8610 18.5349 146.1056 0.5132 5.5923 3.8471 11.0471 8.3558 2.0768 7.5310 4.8654 6.9544 1.3922 0.6128 1.5533 108.1146 47.7959 213.8811 38.1023 5.2542 51.1413 4.1716 8.8895 4.9261 5.2092 36.5703 1.5277 32.0346 19.8487 21.2637 3.5035 35.4879 21.9348 49.8866 75.9865 12.1093 10.5392 4.4175 5.5197 114.8517 41.5505 36.7639 57.5443 26.1850 118.1732 33.1843 15.7927 32.2309 35.8412 9.7919 28.8716 33.6172 9.1518 16.0655 4.6804 4.4482 28.3604 43.3175 99.3452 31.3469 58.5025 15.6816 73.2572 5.4854 45.8749 27.3789 97.6452 33.2284 8.2978 126.0398 42.5039 74.5222 53.3888 633.1084 699.8089 131.4158 1101.8705 41.1834 16.5335 81.6634 20.3564 14.8927 7.3343 48.5374 139.9797 21.8086 49.0980
temp: 298.150 k
press: 1.00000 atm
elementType: 8 8 8 8 7 7 7 7 7 7 7 7 6 6 6 6 6 6 6 6 6 6 1 1 1 1 1 1 1 1 1 1 1 1
symmnumber: 1
zpe: 645573.6 jmol-1
zpe.correction: 0.245886 hartree
zpe.thermalcorrener: 0.265319 hartree
zpe.thermalcorrenthalpy: 0.266263 hartree
zpe.thermalcorrgfe: 0.197960 hartree
zpe.sumelectzpe: -1125.476354 hartree
zpe.sumelectthermal: -1125.456921 hartree
zpe.sumelectthermalent: -1125.455977 hartree
zpe.sumelectthermalfe: -1125.524281 hartree
dipole: 1.1369 1.5226 1.2528
dipole: 2.2761
quadrupole: -88.7116 -146.0642 -134.3693
quadrupole: 10.9402 0.4395 -9.0653
quadrupole: 34.3368 -23.0158 -11.3209 10.9402 0.4395 -9.0653
hfenergy: -1125.7222404 hartree
pointgroup: C01 [X(C10H12N8O4)]
dipole: 0.3352151 -0.673611 -0.4855356 debye
polarizability: 231.8849737|14.7147021|251.7538163|3.7338144|-13.8291906|94.8647872 unknown
InChI: InChI=1S/C10H12N8O4/c11-7-4-8(14-2-13-7)18(10(15-4)16-17-12)9-6(21)5(20)3(1-19)22-9/h2-3,5-6,9,19-21H,1,11H2
charge 0 multiplicity 1
34 atoms
O  1.951398 0.035545 1.204473
O  1.685513 -2.292337 -1.632354
O  3.785407 -2.122914 -0.024173
O  2.610588 2.696951 0.667475
N  -0.214243 -0.37092 0.277344
N  -2.52034 -0.484014 0.132529
N  0.033336 2.111461 -0.006766
N  -1.220719 -2.542778 0.541282
N  -2.122936 3.234011 -0.336038
N  -4.175123 2.064806 -0.343244
N  -2.2414 -3.295369 0.55122
N  -3.054466 -4.150803 0.594106
C  1.911752 -1.025577 -0.979314
C  1.163613 -0.880841 0.388944
C  3.385808 -0.803127 -0.54564
C  3.265031 0.293155 0.52574
C  3.295555 1.710897 -0.125933
C  -0.666955 0.943064 0.072529
C  -1.374579 -1.16903 0.31437
C  -2.084636 0.841166 -0.019595
C  -2.813205 2.047056 -0.234713
C  -0.767735 3.204297 -0.214271
H  1.581654 -0.243481 -1.681827
H  1.091048 -1.872253 0.873422
H  4.036306 -0.50251 -1.389707
H  4.021805 0.219456 1.326311
H  2.867866 1.655797 -1.15505
H  4.350399 2.032269 -0.215361
H  2.278227 -2.954971 -1.182114
H  4.706336 -2.0972 0.330865
H  1.615948 2.487637 0.56083
H  -0.254015 4.167355 -0.282633
H  -4.704708 1.198769 -0.26701
H  -4.645929 2.955233 -0.492295
