program: Gaussian 09
title: 000160749
version: EM64L-G09RevD.01
frameworkgroup: C1[X(C22H22O10)]
method: RPBEPBE
basis: SDD
operation: Freq
keyword: #p
keyword: freq=noraman
keyword: PBEPBE/SDD
title: #p freq=noraman PBEPBE/SDD
converged: YES YES NO NO
title: Mulliken charges:
elementType: O O O O O O O O O O C C C C C C C C C C C C C C C C C C C C C C H H H H H H H H H H H H H H H H H H H H H H
charge: -0.412624 -0.484340 -0.467579 -0.465098 -0.425960 -0.513628 -0.395507 -0.287642 -0.355379 -0.250161 -0.116319 -0.157819 -0.191047 -0.073921 -0.023513 0.133760 -0.387133 0.121901 0.133898 -0.061812 -0.587257 0.286586 0.246275 0.248487 -0.417176 0.340660 -0.373363 -0.332844 -0.366064 -0.348278 0.318996 -0.536528 0.245821 0.221683 0.274043 0.219376 0.248558 0.189070 0.266744 0.399836 0.376295 0.371065 0.285012 0.346678 0.391711 0.393739 0.252887 0.228552 0.273513 0.248022 0.259421 0.227541 0.253416 0.227449
chargesum: 0.00000
title: Mulliken charges with hydrogens summed into heavy atoms:
elementType: O O O O O O O O O O C C C C C C C C C C C C C C C C C C C C C C
charge: -0.412624 -0.084505 -0.091285 -0.094033 -0.079282 -0.121917 -0.001768 -0.287642 -0.355379 -0.250161 0.129502 0.063864 0.082996 0.145455 0.225045 0.133760 0.068680 0.121901 0.133898 -0.061812 -0.302246 0.286586 0.246275 0.248487 -0.164289 0.340660 -0.144811 -0.059331 -0.118042 -0.088857 0.318996 0.171878
polarizability: 5.56034515e+02 -1.25551338e+01 2.68100308e+02 -5.52163352e+00 3.12352092e+01 1.58933876e+02
1716.lowfreq: -4.4737 -0.0009 0.0002 0.0015 2.1336 7.3561 17.1435 20.5550 34.7561
frequency: 17.1308 20.5329 34.7190 39.5299 46.2851 59.3690 78.8487 89.8592 100.1666 106.1163 109.8111 132.8928 150.1042 161.9773 180.4415 187.0463 197.0784 218.0800 221.2462 239.4518 247.3202 256.3748 262.8370 273.4193 276.2232 298.9656 315.6159 334.4397 367.1130 368.3852 384.4414 388.2772 394.4531 409.5297 422.4712 426.7423 431.4505 453.0722 470.9041 477.7788 489.0411 504.0368 507.9937 525.8832 546.4697 557.8399 564.0430 585.0500 594.2896 599.2232 612.0545 617.7513 632.2676 643.5406 649.1771 668.9704 697.8461 738.8049 746.5869 756.0410 772.0870 802.9042 812.8721 839.3812 844.0327 847.3081 854.5002 858.8422 874.5650 950.9643 955.1144 959.3142 972.6263 980.5993 983.8724 985.6233 994.8286 1004.1441 1017.2258 1033.5372 1048.5311 1056.2058 1058.3109 1062.7209 1084.5716 1092.2057 1097.4229 1110.9389 1111.3535 1120.7186 1157.2897 1159.3129 1172.9128 1183.1311 1186.3871 1193.1537 1225.0557 1226.2283 1229.1865 1249.6260 1263.9072 1273.0830 1278.3702 1283.0187 1293.4301 1303.9974 1306.4060 1315.1050 1320.2474 1331.8652 1342.8172 1350.0475 1369.2307 1378.3035 1379.3586 1387.4395 1397.7016 1401.1944 1431.3535 1434.8140 1437.6139 1438.4082 1454.5841 1461.8104 1469.2238 1470.4750 1489.4200 1499.7697 1552.1509 1571.3736 1588.9967 1612.1743 1625.8381 1673.2181 2176.6558 2945.6685 2955.1304 2963.2062 2964.1059 2970.1044 2999.4320 3006.0517 3062.7041 3091.3443 3107.9166 3135.6076 3147.8935 3164.6524 3171.7683 3186.6224 3197.8504 3198.9197 3228.0468 3537.2032 3542.3873 3553.5545
redmass: 5.6852 3.9139 6.8496 7.3589 6.0989 6.8407 5.4193 5.3707 5.8550 7.7015 8.5025 5.0332 3.9186 5.3443 3.7577 4.5484 4.9780 2.5614 2.4127 2.9480 4.4355 6.5268 5.0201 5.6030 5.1915 4.5622 6.0733 5.9037 7.4948 6.7464 6.0166 1.5847 3.4649 2.9352 5.9889 3.0266 1.6880 2.1019 5.0037 1.1522 6.7893 2.9513 6.9296 4.1411 5.3257 3.3746 4.7113 5.2832 4.0873 4.4440 5.2160 5.3908 6.7792 3.5970 1.4326 6.4567 4.0544 3.4102 4.7984 4.9977 5.8761 1.1475 1.3604 3.3671 1.6258 1.6322 1.6560 3.4742 5.5731 1.3882 5.8643 5.6871 6.5252 8.4865 3.9563 1.3492 3.4896 2.7180 4.0243 3.1126 5.9076 2.7528 5.5374 3.0520 3.2185 1.7375 2.3429 1.2596 2.1785 1.3559 1.3299 1.5011 1.3500 1.4532 1.6047 1.6214 1.8949 1.2732 1.1436 2.4891 1.2403 1.3254 3.3863 1.1865 2.8484 1.4617 1.4800 1.5007 1.4909 1.4204 1.3779 1.2960 3.3353 2.5420 1.4916 1.5327 1.8580 4.8750 1.6715 1.7753 2.5441 1.9254 2.5764 1.1906 1.0519 1.0973 2.9281 2.6125 4.4332 7.0121 4.0882 5.0528 6.4255 4.0074 1.0877 1.0816 1.0710 1.0830 1.0833 1.0326 1.0859 1.0855 1.1045 1.0666 1.0929 1.1000 1.0879 1.0887 1.0953 1.0967 1.0931 1.0917 1.0707 1.0652 1.0657 1.0660
irintensity: 0.6299 0.3903 0.1336 1.1146 0.4439 1.8311 2.4072 3.5355 1.9962 1.3978 1.3135 8.9410 1.8904 15.7630 3.5905 10.6673 2.1835 8.5075 3.0615 4.2434 9.7427 2.5036 2.8125 1.1280 5.7629 6.2854 4.9222 6.1560 60.4516 3.4231 2.9097 56.8608 10.8287 0.1317 19.6242 73.6310 137.8514 18.2469 28.8469 161.6059 2.9611 10.3112 3.2690 1.6922 78.9150 6.7419 48.1155 5.8628 49.1446 18.3374 11.5541 21.5559 8.1866 28.0517 139.0189 6.2069 6.9208 1.3180 2.6780 0.6003 1.5836 139.0382 6.8033 42.1677 68.6561 41.6044 10.0555 32.4833 22.7341 0.1276 14.0910 45.5171 250.5668 21.8169 114.5256 0.0785 23.8965 6.2435 97.3329 22.4029 8.7855 151.9847 14.6314 52.3414 58.9526 101.4929 91.9373 0.1161 20.6288 22.6586 34.9697 109.8976 17.1315 106.9727 226.5983 59.9041 310.8747 61.5192 33.4798 89.6105 22.9794 16.1857 50.9009 75.6577 89.8017 39.9443 67.4522 61.8762 32.4546 73.0614 10.4606 13.7773 130.4988 274.2954 50.6744 29.6003 90.4161 233.8520 12.4454 49.9717 183.1065 134.2417 11.4049 17.0549 19.5563 103.3731 13.7427 367.7140 98.4590 19.8273 363.6636 813.4824 35.0021 425.4548 790.7140 14.8288 26.1443 6.4505 40.8942 86.0315 17.2961 102.5593 40.6343 1092.4124 2.0954 23.0859 5.8095 2.5331 12.7545 3.4562 1.8568 3.5907 764.4209 25.0665 29.4901 7.0741
temp: 298.150 k
press: 1.00000 atm
elementType: 8 8 8 8 8 8 8 8 8 8 6 6 6 6 6 6 6 6 6 6 6 6 6 6 6 6 6 6 6 6 6 6 1 1 1 1 1 1 1 1 1 1 1 1 1 1 1 1 1 1 1 1 1 1
symmnumber: 1
zpe: 1073951.0 jmol-1
zpe.correction: 0.409046 hartree
zpe.thermalcorrener: 0.438020 hartree
zpe.thermalcorrenthalpy: 0.438964 hartree
zpe.thermalcorrgfe: 0.348640 hartree
zpe.sumelectzpe: -1601.416999 hartree
zpe.sumelectthermal: -1601.388025 hartree
zpe.sumelectthermalent: -1601.387081 hartree
zpe.sumelectthermalfe: -1601.477405 hartree
dipole: 9.0131 0.6817 -0.5351
dipole: 9.0547
quadrupole: -137.1191 -200.4457 -195.9311
quadrupole: -0.0148 8.6956 5.3980
quadrupole: 40.7129 -22.6138 -18.0991 -0.0148 8.6956 5.3980
hfenergy: -1601.8260452 hartree
pointgroup: C01 [X(C22H22O10)]
dipole: -3.5476039 -0.075238 0.3154401 debye
polarizability: 555.9726037|9.4695739|201.3299105|10.6983546|61.7323092|225.7661849 unknown
InChI: InChI=1S/C22H22O10/c1-30-10-4-2-9(3-5-10)13-6-11(24)16-14(31-13)7-12(25)17(19(16)27)22-21(29)20(28)18(26)15(8-23)32-22/h2-7,15,18,20-23,25-29H,8H2,1H3
charge 0 multiplicity 1
54 atoms
O  4.129777 -0.161282 -1.170127
O  3.528215 0.23926 2.553898
O  6.178006 -0.788469 2.438219
O  7.659496 -0.354505 0.018118
O  5.596012 0.359105 -3.64346
O  1.534553 1.797723 1.576744
O  2.16647 -1.635024 -1.837952
O  -2.26499 -0.382432 -0.529712
O  -0.78992 2.430573 2.185012
O  -8.564568 -0.974593 -0.961181
C  4.037996 -0.308562 1.296642
C  5.563556 -0.094698 1.305803
C  3.429305 0.369408 0.032842
C  6.224963 -0.638432 0.035692
C  5.604994 0.070041 -1.182523
C  1.935145 0.13415 -0.141583
C  6.10779 -0.442003 -2.5310
C  1.045012 0.894676 0.641315
C  1.371631 -0.82701 -1.046595
C  -0.37114 0.749884 0.525431
C  -0.031243 -1.001208 -1.175173
C  -0.873691 -0.207979 -0.392713
C  -1.271603 1.551706 1.336968
C  -3.154708 0.383618 0.242204
C  -2.683931 1.321561 1.150868
C  -4.559153 0.05694 -0.044452
C  -5.62098 0.713191 0.63569
C  -4.891563 -0.932968 -1.017882
C  -6.965812 0.403821 0.364945
C  -6.226604 -1.249727 -1.297029
C  -7.274493 -0.584072 -0.607983
C  -9.69436 -0.325097 -0.283165
H  3.811838 -1.39373 1.274857
H  5.762008 0.998471 1.380577
H  3.617478 1.462863 0.096009
H  6.04257 -1.734222 -0.023403
H  5.778324 1.163246 -1.113641
H  5.844528 -1.516307 -2.645276
H  7.203228 -0.339445 -2.55998
H  2.841551 0.955112 2.375245
H  5.662801 -0.533365 3.248153
H  8.01515 -0.603223 0.911162
H  -0.420456 -1.73865 -1.878721
H  4.605302 0.350556 -3.605191
H  0.660346 2.263919 2.017177
H  3.127226 -1.319539 -1.737174
H  -3.378682 1.912367 1.748806
H  -5.406935 1.477189 1.389601
H  -4.087966 -1.44783 -1.549786
H  -7.756646 0.928451 0.908187
H  -6.488375 -2.00679 -2.041676
H  -9.667253 -0.513959 0.806816
H  -10.591091 -0.78789 -0.718781
H  -9.703209 0.764284 -0.477124
