program: Gaussian 09
title: 000160707
version: EM64L-G09RevD.01
frameworkgroup: C1[X(C12H24O2)]
method: RPBEPBE
basis: SDD
operation: Freq
keyword: #pfreq=noraman
keyword: PBEPBE/SDD
title: #p freq=noraman PBEPBE/SDD
converged: YES YES NO NO
title: Mulliken charges:
elementType: O O C C C C C C C C C C C C H H H H H H H H H H H H H H H H H H H H H H H H
charge: -0.299913 -0.183899 0.397232 -0.468940 -0.398937 -0.399421 -0.020371 -0.754994 -0.753662 -0.459171 -0.733782 -0.226164 -0.078912 -0.683511 0.206021 0.202824 0.206615 0.232069 0.197893 0.188609 0.193630 0.213442 0.217385 0.232047 0.240268 0.196253 0.226282 0.220868 0.235927 0.210303 0.229825 0.226943 0.194057 0.183228 0.158419 0.200218 0.227589 0.223730
chargesum: 0.00000
title: Mulliken charges with hydrogens summed into heavy atoms:
elementType: O O C C C C C C C C C C C C
charge: -0.299913 -0.183899 0.397232 -0.060095 0.039747 -0.012919 0.173259 -0.092120 -0.090859 -0.002376 -0.066711 0.151121 0.079507 -0.031973
polarizability: 1.62018333e+02 5.20686299e+00 1.32828017e+02 6.48748812e-01 -1.85631307e+00 1.16769571e+02
1716.lowfreq: -11.2699 0.0004 0.0007 0.0008 4.1231 6.1509 23.5424 35.5890 45.2356
frequency: 23.1178 34.6860 45.0512 50.0853 57.4414 79.1944 102.9342 109.4423 149.0707 163.1373 186.1858 202.2713 208.4169 232.2153 242.9584 251.0915 257.6589 321.8414 327.7105 336.1294 374.8004 399.3355 425.5738 470.9379 488.1610 516.2007 541.7297 725.2340 733.6597 756.8579 806.7788 816.6675 824.5560 874.7397 910.8148 918.9345 923.2510 935.9753 957.2181 985.8339 991.9985 1020.9337 1043.0694 1046.3083 1067.1055 1076.1512 1107.9988 1118.8559 1134.2737 1135.3457 1165.1858 1175.0823 1203.0452 1214.5664 1233.2266 1244.3529 1252.8682 1271.5290 1281.2527 1301.3208 1319.9090 1332.8480 1343.8763 1355.0940 1360.7430 1373.8343 1388.8989 1390.7313 1391.6372 1394.8593 1432.4966 1450.5865 1458.0631 1458.5664 1464.4380 1466.7442 1473.7180 1475.1977 1478.7422 1482.8541 1486.6400 1489.4829 1496.5873 1646.7606 2836.8368 2931.0361 2942.1780 2947.7976 2953.4882 2962.0488 2975.1711 2976.5054 2978.5139 2983.5424 2990.8767 2992.1077 2997.9232 3009.8136 3049.0760 3053.4551 3064.3016 3073.2973 3083.0900 3083.8209 3088.6758 3091.0025 3098.0636 3099.7826
redmass: 4.0241 2.7210 2.0144 4.9615 3.0347 2.9677 2.6307 1.8373 2.2097 3.1269 2.5643 1.1794 2.2324 1.1116 1.2175 1.1906 2.5628 2.6773 2.4328 2.7645 2.8598 2.2203 2.4701 2.6961 2.5388 2.9796 2.9357 3.6177 1.1421 1.6946 1.5917 1.2399 1.8343 1.8239 1.8527 1.5363 1.6092 2.0959 1.6438 1.5026 1.6235 2.1833 3.0062 3.6090 1.8200 1.7156 2.2822 2.7009 1.4436 1.9931 1.9290 1.9792 1.7641 1.5109 1.3789 2.1058 1.1701 1.3887 1.2455 1.2639 1.3859 1.4417 1.4602 1.5363 1.3118 1.2562 1.2222 1.2070 1.2629 1.2105 1.0890 1.0579 1.0447 1.0733 1.0682 1.0588 1.0556 1.0549 1.0659 1.0588 1.0571 1.0586 1.0785 7.8585 1.0839 1.0557 1.0707 1.0703 1.0642 1.0594 1.0379 1.0592 1.0554 1.0859 1.0357 1.0363 1.0972 1.0987 1.1023 1.0962 1.0988 1.0988 1.0984 1.1003 1.0991 1.0992 1.1009 1.0995
irintensity: 0.8733 0.6222 2.1043 5.6568 1.4988 4.2189 2.5694 0.2894 4.2340 1.5140 1.2080 0.3452 0.5922 0.2479 0.3382 0.3601 2.1558 1.3265 2.7382 2.6663 2.7651 5.5663 2.9833 4.6737 0.9050 0.2819 6.1024 7.4541 4.0010 2.2159 1.7848 3.0925 2.5821 2.8313 4.6398 2.3402 5.7228 26.6631 6.6429 1.6257 3.6310 24.1906 19.6336 70.4221 4.3540 5.1154 8.4049 0.3221 5.0674 5.0225 28.8086 25.0696 14.7653 32.4149 42.0514 17.0548 4.0521 3.1941 1.3193 12.7489 14.9753 1.8337 0.3735 0.5030 13.6412 17.6711 34.2565 1.4399 16.7802 16.6912 8.9227 2.1937 9.0762 2.9480 2.6560 5.2169 0.8694 7.9177 3.7127 2.5970 21.9933 24.7496 5.9480 179.4560 112.1322 43.1780 7.5323 34.3075 19.5245 24.9853 14.4486 19.5338 38.0130 82.6655 34.5840 11.4728 28.9342 8.5353 42.5868 33.9969 54.0069 43.2314 38.4558 5.4719 38.9652 57.1952 35.3677 42.1489
temp: 298.150 k
press: 1.00000 atm
elementType: 8 8 6 6 6 6 6 6 6 6 6 6 6 6 1 1 1 1 1 1 1 1 1 1 1 1 1 1 1 1 1 1 1 1 1 1 1 1
symmnumber: 1
zpe: 882413.9 jmol-1
zpe.correction: 0.336094 hartree
zpe.thermalcorrener: 0.354750 hartree
zpe.thermalcorrenthalpy: 0.355694 hartree
zpe.thermalcorrgfe: 0.287567 hartree
zpe.sumelectzpe: -620.930949 hartree
zpe.sumelectthermal: -620.912293 hartree
zpe.sumelectthermalent: -620.911349 hartree
zpe.sumelectthermalfe: -620.979475 hartree
dipole: -3.1292 -1.7948 -0.8283
dipole: 3.7013
quadrupole: -120.5777 -85.3190 -88.5770
quadrupole: -6.9869 7.5926 -1.6278
quadrupole: -22.4198 12.8389 9.5809 -6.9869 7.5926 -1.6278
hfenergy: -621.2670425 hartree
pointgroup: C01 [X(C12H24O2)]
dipole: -1.2438059 0.6599548 0.3713636 debye
polarizability: 162.2201112|-4.5211291|132.7671029|-1.1899113|-0.9682548|116.6287064 unknown
InChI: InChI=1S/C12H24O2/c1-5-14-12(3,4)9-6-7-11(2)8-10-13/h10-11H,5-9H2,1-4H3
charge 0 multiplicity 1
38 atoms
O  -2.977456 -0.573696 -0.471433
O  5.986213 -0.287216 0.130439
C  -2.776238 0.836477 -0.014538
C  -1.382731 1.009058 0.657474
C  -0.182093 0.559586 -0.203556
C  1.142604 0.583369 0.591771
C  2.402672 0.226506 -0.241541
C  -3.898299 1.258587 0.964134
C  -2.88923 1.632598 -1.329439
C  3.68697 0.46781 0.604613
C  2.366474 -1.226962 -0.771874
C  -2.986812 -1.619661 0.560729
C  4.95743 0.341475 -0.214817
C  -3.217983 -2.94703 -0.165742
H  -1.267121 2.076654 0.935584
H  -1.372767 0.443192 1.612253
H  -0.084695 1.219784 -1.088658
H  -0.388701 -0.455755 -0.590888
H  1.069895 -0.117282 1.450893
H  1.278298 1.59611 1.028011
H  2.436991 0.915863 -1.11445
H  -3.812007 0.749737 1.941527
H  -3.852044 2.347366 1.149853
H  -4.886919 1.0236 0.530978
H  -2.188265 1.23656 -2.082778
H  -2.668695 2.702555 -1.162229
H  -3.910431 1.540429 -1.738123
H  3.659322 1.505719 1.004397
H  3.736852 -0.22083 1.468404
H  2.306619 -1.945611 0.068082
H  1.495821 -1.396434 -1.428802
H  3.275576 -1.469753 -1.35307
H  -3.796269 -1.436375 1.298657
H  -2.020213 -1.641264 1.109779
H  4.925628 0.884002 -1.198942
H  -3.241096 -3.786073 0.553932
H  -4.177379 -2.923496 -0.710895
H  -2.412719 -3.132699 -0.897736
