program: Gaussian 09
title: 000013216
version: EM64L-G09RevD.01
frameworkgroup: C1[X(C10H18O)]
method: RPBEPBE
basis: SDD
operation: Freq
keyword: #pfreq=noraman
keyword: PBEPBE/SDD
title: #p freq=noraman PBEPBE/SDD
converged: NO YES NO NO
title: Mulliken charges:
elementType: O C C C C C C C C C C H H H H H H H H H H H H H H H H H H
charge: -0.438873 -0.016935 -0.022619 -0.511165 -0.466594 -0.463109 -0.457366 -0.080998 -0.444699 -0.402181 -0.402239 0.200074 0.190624 0.218644 0.185424 0.201931 0.199152 0.200215 0.195389 0.196537 0.193696 0.221251 0.180618 0.221105 0.193640 0.198934 0.192265 0.198920 0.318360
chargesum: 0.00000
title: Mulliken charges with hydrogens summed into heavy atoms:
elementType: O C C C C C C C C C C
charge: -0.120513 0.183139 0.168005 -0.107097 -0.065512 -0.067505 -0.067133 0.140253 -0.042977 -0.009607 -0.011053
polarizability: 1.21560526e+02 4.89084904e-02 1.03293166e+02 -1.57229401e+00 -8.74238609e-01 8.90890668e+01
1716.lowfreq: -42.3044 -23.9918 -12.1934 0.0005 0.0007 0.0010 82.4221 118.1500 182.8338
frequency: 82.3365 118.1489 182.8302 222.2895 234.7509 302.4466 308.6200 326.3879 342.7520 363.5792 401.9058 435.3518 457.7002 487.7697 518.3569 579.6874 742.8362 793.4621 832.1069 833.7981 856.3427 864.5244 901.5333 918.6390 955.3354 971.3102 994.3754 1000.3066 1040.4953 1052.5295 1054.7086 1081.6615 1101.3673 1108.1689 1125.1704 1133.6697 1142.5131 1181.9550 1195.7812 1227.7312 1243.4288 1249.0197 1261.2768 1281.5850 1283.7314 1301.1943 1306.4131 1323.5431 1327.7445 1334.1229 1340.0261 1340.6834 1343.9659 1347.6081 1355.8672 1372.5518 1452.6514 1457.5526 1460.4539 1463.6278 1466.4381 1468.4956 1474.0452 2910.1387 2923.1292 2938.6742 2949.7348 2950.8172 2953.8888 2959.8126 2962.7000 2963.4254 3011.9565 3014.9604 3016.7505 3023.1145 3023.7601 3031.2848 3035.5690 3046.6549 3537.3800
redmass: 3.3956 2.4112 2.2211 2.6898 2.3325 1.2573 1.7611 2.0544 3.2962 3.2985 3.3852 2.7864 2.1143 2.3041 2.2063 2.1858 2.2000 1.6693 1.9870 1.8448 1.6926 1.9063 2.3724 1.4559 2.7110 1.7490 2.2430 1.9146 2.2952 1.3257 1.2247 2.0932 1.6489 2.0959 2.1293 1.8250 1.9570 1.6886 1.5022 1.3140 1.3272 1.3174 1.2664 1.3107 1.2450 1.3265 1.3056 1.3939 1.4123 1.3989 1.5284 1.5109 1.5817 1.5870 1.4674 1.2235 1.0897 1.0907 1.0913 1.0871 1.0845 1.0930 1.0960 1.0793 1.0810 1.0670 1.0666 1.0617 1.0628 1.0617 1.0611 1.0660 1.0968 1.0918 1.0942 1.0976 1.0970 1.0955 1.1029 1.0974 1.0657
irintensity: 1.2799 1.5834 1.6578 0.9160 4.4596 83.8933 0.6237 0.0690 21.9335 21.1141 3.0209 2.6713 1.1161 1.8373 2.1875 0.6894 0.2524 2.1168 6.4048 14.6078 3.0321 0.7842 1.5211 11.0367 17.4638 27.4159 33.5329 31.8271 10.1946 6.8960 0.8249 0.3993 17.6236 4.4253 12.5231 2.3004 0.8993 3.4714 3.6794 0.3804 7.8081 4.9292 5.0742 1.8557 8.3062 2.9141 0.5274 0.9270 0.8936 0.7804 0.8067 0.9954 1.4323 2.8831 1.5794 36.5325 2.8126 1.2320 5.9624 5.5731 32.0667 7.8439 3.1580 0.2231 11.5310 14.4659 25.6242 12.0949 51.6103 110.1969 31.4140 32.1792 25.0972 14.2466 39.2374 61.6780 69.3390 43.9915 108.0116 93.0223 5.8681
temp: 298.150 k
press: 1.00000 atm
elementType: 8 6 6 6 6 6 6 6 6 6 6 1 1 1 1 1 1 1 1 1 1 1 1 1 1 1 1 1 1
symmnumber: 1
zpe: 687763.1 jmol-1
zpe.correction: 0.261955 hartree
zpe.thermalcorrener: 0.272467 hartree
zpe.thermalcorrenthalpy: 0.273411 hartree
zpe.thermalcorrgfe: 0.226774 hartree
zpe.sumelectzpe: -466.199043 hartree
zpe.sumelectthermal: -466.188532 hartree
zpe.sumelectthermalent: -466.187587 hartree
zpe.sumelectthermalfe: -466.234225 hartree
dipole: 1.9156 0.6249 1.1262
dipole: 2.3084
quadrupole: -79.7309 -69.8003 -65.8424
quadrupole: -2.7641 -5.0973 -1.1066
quadrupole: -7.9397 1.9909 5.9488 -2.7641 -5.0973 -1.1066
hfenergy: -466.4609984 hartree
pointgroup: C01 [X(C10H18O1)]
dipole: -0.7547316 -0.2546546 0.4362585 debye
polarizability: 121.5379368|0.1550054|103.2791219|1.7721388|1.0031249|89.1257003 unknown
InChI: InChI=1S/C10H18O/c11-10-6-5-8-3-1-2-4-9(8)7-10/h8-11H,1-7H2
charge 0 multiplicity 1
29 atoms
O  3.598837 0.803819 0.064464
C  -0.256661 0.638228 -0.277896
C  -0.463997 -0.803566 0.264262
C  1.129949 1.190345 0.137384
C  0.691806 -1.72938 -0.186426
C  -1.407725 1.570563 0.172582
C  -1.847792 -1.355724 -0.156878
C  2.276985 0.26252 -0.312282
C  2.075101 -1.169747 0.223524
C  -2.790966 1.016398 -0.242961
C  -3.00028 -0.42309 0.285073
H  -0.283169 0.577267 -1.390867
H  -0.441437 -0.743384 1.377528
H  1.290489 2.20062 -0.28648
H  1.163163 1.2914 1.24578
H  0.652544 -1.841966 -1.290948
H  0.552282 -2.742887 0.23937
H  -1.256364 2.584201 -0.249854
H  -1.371889 1.67685 1.278161
H  -1.992044 -2.370337 0.266338
H  -1.868832 -1.46617 -1.262461
H  2.322557 0.240166 -1.417437
H  2.149184 -1.149038 1.333181
H  2.892146 -1.817251 -0.146618
H  -2.864312 1.0127 -1.350574
H  -3.595455 1.681172 0.128482
H  -3.046389 -0.400483 1.39402
H  -3.971626 -0.822064 -0.067459
H  3.638494 0.859339 1.054391
