program: Gaussian 09
title: 000160658
version: EM64L-G09RevD.01
frameworkgroup: C1[X(C12H7N3O2)]
method: RPBEPBE
basis: SDD
operation: Freq
keyword: #p
keyword: freq=noraman
keyword: PBEPBE/SDD
title: #p freq=noraman PBEPBE/SDD
converged: YES YES NO YES
title: Mulliken charges:
elementType: O O N N N C C C C C C C C C C C C H H H H H H H
charge: -0.221820 -0.157475 0.065982 -0.008088 0.016490 -0.050114 0.069070 0.040254 0.059210 0.296247 -0.336715 -0.363188 -0.312927 -0.321515 -0.199525 -0.211885 -0.212281 0.275165 0.297511 0.277045 0.248938 0.266917 0.241742 0.240964
chargesum: 0.00000
title: Mulliken charges with hydrogens summed into heavy atoms:
elementType: O O N N N C C C C C C C C C C C C
charge: -0.221820 -0.157475 0.065982 -0.008088 0.016490 -0.050114 0.069070 0.040254 0.059210 0.296247 -0.061550 -0.065677 -0.035883 -0.054598 0.049414 0.029856 0.028683
polarizability: 2.91273818e+02 -2.34755307e+01 1.81913578e+02 -3.26024607e-02 -7.18630061e-04 5.75105760e+01
1716.lowfreq: -63.4175 -12.5498 -4.7204 -0.0003 -0.0002 0.0005 8.7671 55.3417 95.4737
frequency: -63.4121 55.3388 95.4736 148.0426 163.0050 248.6408 275.1550 279.7537 346.5722 369.0293 398.6257 433.1740 479.6999 492.6102 516.7612 518.1412 535.4877 580.1023 596.8685 627.5768 654.8077 695.8862 720.9030 745.7627 777.9673 777.9779 795.7778 838.8736 841.4214 890.7015 898.7797 940.7922 962.9611 981.4145 1001.6440 1003.6099 1005.3552 1065.9899 1117.8808 1148.1935 1159.0081 1172.0043 1180.1693 1226.7175 1255.9323 1265.5108 1280.3880 1332.9477 1366.1335 1374.4359 1395.6125 1432.4853 1458.3971 1472.7315 1499.0024 1525.7189 1541.3313 1596.1751 1629.5533 3139.9471 3153.3636 3154.4545 3168.9290 3173.0554 3177.8461 3185.3169
redmass: 14.0405 5.7704 5.3072 8.5946 5.0168 5.1186 7.2214 4.9006 10.1544 7.0953 5.4578 6.4227 3.6915 3.5692 8.9448 4.8870 6.9963 3.6793 8.4077 8.9379 6.3995 7.9389 9.1069 2.7099 2.4969 2.1539 2.1763 6.0393 2.3356 1.7376 6.7800 8.4781 1.3745 1.3432 2.1741 1.3606 1.3350 1.8956 1.7335 1.5558 1.3748 1.4982 6.9192 2.4979 3.7678 3.1303 2.3184 3.2008 3.0167 3.6496 4.8160 3.7443 3.1849 3.6625 8.6350 6.7905 7.5197 5.9045 6.8917 1.0865 1.0896 1.0875 1.0963 1.0942 1.1005 1.0971
irintensity: 0.1430 0.6904 5.4252 2.5964 0.0809 0.0001 2.5583 0.0104 0.2312 1.3412 6.9776 1.1974 0.5477 0.0173 0.4847 0.0846 2.0715 0.2087 2.9980 7.6213 3.0945 18.0422 14.7671 37.9410 59.2884 68.1728 3.8272 14.5012 28.7843 0.0483 1.3126 11.5983 0.5942 2.5057 5.8583 2.0713 0.0000 12.7197 2.9776 10.3138 0.9748 8.6627 327.9516 0.5560 3.0910 1.8465 0.0160 4.3962 20.0150 47.3506 15.4575 51.3950 6.8135 5.2155 13.0204 56.8403 13.8950 2.7561 0.7687 4.0050 6.2908 2.0379 8.8925 11.3056 23.3960 5.9428
temp: 298.150 k
press: 1.00000 atm
elementType: 8 8 7 7 7 6 6 6 6 6 6 6 6 6 6 6 6 1 1 1 1 1 1 1
symmnumber: 1
zpe: 438694.1 jmol-1
zpe.correction: 0.167090 hartree
zpe.thermalcorrener: 0.178441 hartree
zpe.thermalcorrenthalpy: 0.179386 hartree
zpe.thermalcorrgfe: 0.129313 hartree
zpe.sumelectzpe: -774.933974 hartree
zpe.sumelectthermal: -774.922622 hartree
zpe.sumelectthermalent: -774.921678 hartree
zpe.sumelectthermalfe: -774.971751 hartree
dipole: 3.7375 4.0342 -0.0002
dipole: 5.4994
quadrupole: -85.3527 -97.2037 -98.4965
quadrupole: -19.2996 0.0103 -0.0067
quadrupole: 8.3316 -3.5194 -4.8122 -19.2996 0.0103 -0.0067
hfenergy: -775.1010638 hartree
pointgroup: C01 [X(C12H7N3O2)]
dipole: 1.4066923 1.6439572 -0.0000618 debye
dipolederiv: -1.0212725 -0.1835466 0.0012259 -0.2967873 -0.5117217 -0.00009 0.00157 0.0000697 -0.2469962 -0.4475553 0.0377174 0.0007611 -0.0212917 -0.7024316 -0.0010429 0.000855 -0.0006063 -0.1867304 -0.2692107 -0.0662741 0.0000944 0.0612347 -0.0945301 0.0000251 -0.0003108 -0.0000858 -0.2397564 -0.0327445 -0.0781576 0.0000282 -0.041292 -0.1666664 0.0000103 0.0001275 0.0000068 -0.2747883 1.341525 0.2817382 -0.0024206 0.6589308 1.4523869 0.0012518 -0.0025114 0.0006916 0.1922242 0.3387214 0.0342221 0.0002274 0.0993732 -0.1683874 0.0000198 0.000169 -0.0002276 0.1066828 -0.0978747 0.1026659 -0.0000896 -0.1983791 -0.056466 0.00002 0.0001428 0.0000682 0.1375081 0.1455942 0.0686019 -0.0000355 -0.5990175 0.1078467 0.0000495 0.0002574 0.0001194 0.1384713 0.2448951 -0.1168207 0.0000254 0.4600027 -0.1993006 0.0001123 -0.0004236 0.0001483 0.1444447 0.0055028 -0.0126805 0.0003164 -0.3799913 -0.5387731 -0.0001793 0.0000223 -0.0002577 0.0365493 0.2640306 0.1145909 -0.000046 -0.0976325 0.1584916 -0.000067 -0.0000205 0.0000047 -0.132246 -0.1400524 -0.0326476 0.0000014 0.4964729 0.2218547 -0.0000515 0.0001539 0.0002989 -0.082591 -0.2305545 0.0129479 0.0000005 0.0436391 0.1219605 -0.0001368 0.0000998 -0.0000691 -0.1611679 -0.0586992 0.0811053 -0.0000334 0.1259763 0.0936474 -0.0000853 0.0000114 -0.0001311 -0.167044 -0.3351713 -0.2835355 -0.0000166 -0.4210176 0.0066869 0.000024 0.0000233 0.0001275 -0.1448484 -0.0347781 -0.0985502 0.0000331 -0.1732203 0.1806466 -0.0001089 0.0000571 -0.0001255 -0.1324724 0.1475431 0.1249632 -0.000073 0.2226339 -0.0588661 -0.0000414 -0.0000974 -0.0000336 -0.133428 0.0934076 -0.0638022 0.0000166 0.0087743 -0.0113622 0.0000328 -0.000061 -0.0000401 0.1626738 0.0679716 -0.0071355 -0.0000547 -0.0169063 0.1414194 0.0000054 -0.0000565 -0.0001639 0.1679507 0.0850099 -0.0638574 0.0000104 0.0143021 -0.0110271 0.0000778 0.000006 0.0000627 0.1662865 -0.0006364 0.0937078 0.000012 0.0746901 -0.0126069 -0.0000062 -0.0000231 -0.0000195 0.1616518 0.0694222 -0.0024083 0.0000144 -0.0828923 -0.0274123 0.0000831 0.0000229 0.0000583 0.1666498 -0.0185109 0.1012658 -0.0000324 0.1035328 -0.0087479 0.0000625 -0.0000471 0.0000646 0.1605211 -0.1165631 -0.0441101 0.0000344 -0.0411349 0.0833587 0.0000349 0.000033 0.0000393 0.1604552 unknown
polarizability: 292.9542779|-19.091912|180.2331184|-0.0325487|-0.0020041|57.510576 unknown
InChI: InChI=1S/C12H7N3O2/c16-15(17)11-7-3-6-10-12(11)14-9-5-2-1-4-8(9)13-10/h1-7H
charge 0 multiplicity 1
24 atoms
O  -4.053609 -1.687327 0.002405
O  -1.992891 -2.644418 -0.003017
N  0.19909 -0.989923 0.000442
N  1.01296 1.784731 -0.000354
N  -2.755905 -1.6136 -0.000238
C  -0.729472 0.01233 0.000012
C  -0.309752 1.424538 -0.000196
C  1.520208 -0.626417 0.00033
C  1.938068 0.775818 -0.000198
C  -2.160774 -0.239099 0.000056
C  -1.284168 2.478476 -0.00015
C  -3.075899 0.815283 0.00024
C  2.521607 -1.655878 0.000743
C  3.338483 1.094705 -0.000403
C  -2.640856 2.176396 0.00014
C  3.870287 -1.311185 0.000541
C  4.280562 0.070524 -0.000051
H  -0.910959 3.506876 -0.000328
H  -4.140996 0.568781 0.000362
H  2.180165 -2.695186 0.001154
H  -3.389386 2.974314 0.000221
H  3.623797 2.151028 -0.000821
H  4.63563 -2.094581 0.000819
H  5.34951 0.309115 -0.000209
