program: Gaussian 09
title: 000160648
version: EM64L-G09RevD.01
frameworkgroup: C1[X(C12H13NO2)]
method: RPBEPBE
basis: SDD
operation: Freq
keyword: #p
keyword: freq=noraman
keyword: PBEPBE/SDD
title: #p freq=noraman PBEPBE/SDD
converged: NO NO NO NO
title: Mulliken charges:
elementType: O O N C C C C C C C C C C C C H H H H H H H H H H H H H
charge: -0.251850 -0.196556 -0.084911 -0.177637 0.084425 -0.226497 -0.583933 -0.455190 -0.378585 -0.448626 0.490718 -0.135845 -0.360792 -0.529898 0.119343 0.259618 0.255073 0.271851 0.242689 0.239051 0.242478 0.232399 0.185526 0.225107 0.227345 0.228381 0.241893 0.284425
chargesum: 0.00000
title: Mulliken charges with hydrogens summed into heavy atoms:
elementType: O O N C C C C C C C C C C C C
charge: -0.251850 -0.196556 -0.084911 0.081981 0.084425 0.028576 -0.069393 0.026339 0.039340 0.003826 0.490718 0.092537 -0.118899 -0.245474 0.119343
polarizability: 1.79525650e+02 -1.66471402e+01 1.35312199e+02 -9.67183525e+00 -1.80573081e+00 9.25142445e+01
1716.lowfreq: -16.7278 -3.5706 -0.0008 -0.0004 -0.0003 13.3078 80.2884 97.8239 142.4885
frequency: 79.9678 97.7841 142.4712 184.2821 218.4591 247.4883 311.9278 320.0854 350.4453 375.9793 427.4194 457.7805 521.4771 542.1748 551.5920 583.6406 637.0657 657.4884 683.1150 692.1572 752.6663 777.5850 793.7774 815.1078 835.6277 859.5078 870.2682 872.9865 889.9033 904.6384 925.4442 945.8151 974.8337 990.4499 1007.1526 1029.5520 1050.9596 1084.0129 1088.2132 1111.6103 1117.4330 1130.3975 1136.5275 1146.8694 1169.7805 1171.9384 1184.5512 1216.6179 1233.8353 1258.7239 1273.1511 1286.7459 1302.9016 1309.1749 1327.8476 1339.3559 1346.6660 1370.9858 1466.3849 1472.1624 1476.7888 1497.9183 1579.0922 1638.9178 1693.0797 2897.5773 3012.0712 3013.3442 3018.6312 3029.2335 3037.8632 3064.5163 3079.8989 3094.8366 3103.3347 3132.5887 3159.1094 3213.7030
redmass: 3.6115 4.4475 3.4828 3.9702 4.0768 2.0464 3.2559 4.6926 4.2974 3.9404 3.3966 4.6825 3.6871 3.4386 4.3223 2.7945 4.0908 3.7005 4.1994 4.9712 4.0126 2.2497 2.2223 6.1864 2.9040 2.2760 1.6345 2.7294 2.4721 1.5788 2.3529 2.2613 1.4341 1.8500 2.9457 2.8680 2.5919 3.9984 2.1309 2.4572 1.9255 3.0980 1.4926 1.6715 1.4705 1.3635 1.7046 1.3458 1.5756 1.3018 1.3638 1.3523 1.3946 1.3471 1.9840 1.4155 1.7957 1.7824 1.0882 1.1011 1.0903 1.0884 6.4299 8.3161 12.2528 1.0703 1.0647 1.0834 1.0657 1.0603 1.0897 1.0883 1.1018 1.1039 1.1057 1.0867 1.1005 1.0983
irintensity: 0.9958 2.1809 5.2981 1.1246 0.4461 4.4811 1.0632 1.4218 1.8771 5.4749 1.5025 4.0937 3.8123 1.1265 4.1181 6.3709 3.0871 15.4009 0.9298 2.1799 1.4444 9.1785 13.8134 78.6718 3.6494 10.7279 53.2654 6.0820 5.3015 0.1886 4.1504 16.1981 3.4092 5.0531 24.5265 16.4077 8.2144 21.0946 36.5680 12.4159 25.8661 13.4323 10.6809 14.0174 1.3042 2.5217 12.2176 2.5015 15.8753 2.9983 4.9668 3.5887 11.4747 3.5091 0.2299 0.5538 3.4870 2.4537 4.4405 12.0646 11.1123 11.4369 1.0867 112.2467 495.1839 80.3745 18.5155 26.5060 13.1222 14.1307 71.5614 32.4168 24.1098 40.4843 16.7070 1.3582 24.2878 0.7717
temp: 298.150 k
press: 1.00000 atm
elementType: 8 8 7 6 6 6 6 6 6 6 6 6 6 6 6 1 1 1 1 1 1 1 1 1 1 1 1 1
symmnumber: 1
zpe: 596143.8 jmol-1
zpe.correction: 0.227059 hartree
zpe.thermalcorrener: 0.238316 hartree
zpe.thermalcorrenthalpy: 0.239260 hartree
zpe.thermalcorrgfe: 0.190290 hartree
zpe.sumelectzpe: -669.146651 hartree
zpe.sumelectthermal: -669.135394 hartree
zpe.sumelectthermalent: -669.134450 hartree
zpe.sumelectthermalfe: -669.183420 hartree
dipole: -4.3992 3.6806 -0.0067
dipole: 5.7358
quadrupole: -97.3564 -86.0905 -86.3821
quadrupole: 13.6111 -6.7968 1.9656
quadrupole: -7.4134 3.8525 3.5609 13.6111 -6.7968 1.9656
hfenergy: -669.3737102 hartree
pointgroup: C01 [X(C12H13N1O2)]
dipole: -1.737923 1.4393999 0.0120931 debye
polarizability: 179.5770442|-16.402823|135.1592357|-10.2137117|-1.617505|92.6158142 unknown
InChI: InChI=1S/C12H13NO2/c14-11-6-8-3-4-9-7-12(8,15-11)10-2-1-5-13(9)10/h3-4,6,9-10H,1-2,5,7H2
charge 0 multiplicity 1
28 atoms
O  1.343268 -1.192634 0.593631
O  3.607819 -1.623881 0.135204
N  -1.920473 0.382155 -0.302884
C  -0.780591 -0.568806 -0.628434
C  0.408488 -0.095694 0.295282
C  -1.352797 1.380857 0.678874
C  -0.319915 0.543097 1.500285
C  -1.315234 -1.991887 -0.325853
C  -3.083621 -0.425385 0.193362
C  -2.853238 -1.818984 -0.432101
C  1.259174 0.981657 -0.371578
C  -0.639785 2.474169 -0.117061
C  0.616025 2.262564 -0.629378
C  2.532854 0.509293 -0.539789
C  2.641083 -0.846658 0.048575
H  -0.491881 -0.467557 -1.689808
H  -2.164615 1.802372 1.293602
H  0.348819 1.143583 2.137357
H  -0.831274 -0.218577 2.114647
H  -1.026516 -2.302372 0.6947
H  -0.911641 -2.743293 -1.023314
H  -4.036414 0.03493 -0.122743
H  -3.0916 -0.508942 1.306533
H  -3.167752 -1.814591 -1.491566
H  -3.411676 -2.613381 0.092045
H  -1.171307 3.414534 -0.301604
H  1.140794 3.032133 -1.206024
H  3.391206 1.007798 -0.98946
