program: Gaussian 09
title: 000160642
version: EM64L-G09RevD.01
frameworkgroup: C1[X(C22H18O2)]
method: RPBEPBE
basis: SDD
operation: Freq
keyword: #pfreq=noraman
keyword: PBEPBE/SDD
title: #p freq=noraman PBEPBE/SDD
converged: YES YES NO NO
title: Mulliken charges:
elementType: O O C C C C C C C C C C C C C C C C C C C C C C H H H H H H H H H H H H H H H H H H
charge: -0.266914 -0.260465 0.129659 0.326980 0.180340 -0.055333 0.184350 0.332951 0.117322 0.420520 -0.429577 -0.633161 -0.512851 -0.390314 -0.830681 -0.452895 -0.390087 -0.454099 -0.292207 -0.264590 -0.266240 -0.251788 0.304839 -0.748042 0.252176 0.284237 0.282923 0.235600 0.280323 0.237477 0.239284 0.240210 0.228132 0.314248 0.241459 0.233717 0.228961 0.228162 0.230052 0.253385 0.246271 0.245667
chargesum: 0.00000
title: Mulliken charges with hydrogens summed into heavy atoms:
elementType: O O C C C C C C C C C C C C C C C C C C C C C C
charge: -0.266914 -0.260465 0.129659 0.326980 0.180340 -0.055333 0.184350 0.332951 0.117322 0.420520 -0.177402 -0.066001 -0.277251 -0.109991 -0.113710 -0.224763 -0.075839 -0.212640 -0.058490 -0.035629 -0.038078 -0.021736 0.304839 -0.002718
polarizability: 4.08820561e+02 -3.15715059e+01 3.03429285e+02 9.85110603e-01 -3.06304470e+00 1.18178386e+02
1716.lowfreq: -8.2452 -0.0008 -0.0008 -0.0007 3.0543 5.3458 21.2532 32.2727 47.2768
frequency: 21.2110 32.2241 47.2426 55.5613 60.5117 78.4795 98.6533 121.6778 134.4314 159.0192 185.1019 201.5428 207.7676 229.6287 279.1075 307.7989 339.3344 354.8401 365.2461 402.7406 418.1871 440.4602 450.6941 453.9301 495.4176 513.4367 522.0575 536.2567 559.1885 571.5798 588.4201 591.7867 595.9600 629.4496 651.3222 656.1356 702.3996 724.2590 757.0754 766.4749 770.2170 785.3775 801.2144 813.2917 824.4524 844.3279 874.9626 888.2445 894.5613 901.0904 920.8948 965.9532 968.6358 983.4097 989.9204 995.2115 999.2045 1013.6917 1027.1550 1037.8915 1041.6718 1053.4386 1053.9721 1072.0131 1082.0333 1113.7956 1153.5383 1182.8973 1184.6632 1186.8780 1193.4407 1226.3147 1237.0495 1249.8273 1282.0282 1294.1465 1318.5929 1343.6519 1349.3983 1371.3375 1380.7922 1382.6228 1393.5360 1401.3214 1415.0610 1428.9729 1437.2118 1452.2679 1454.5581 1457.0997 1471.1702 1481.6146 1499.7998 1503.0286 1515.9254 1547.4827 1561.6037 1566.8162 1613.2370 1616.4585 1630.5390 1643.4267 2982.7748 3008.1898 3047.3625 3054.7767 3097.1757 3109.6387 3120.9509 3122.5418 3127.1437 3130.8828 3134.1174 3143.0644 3147.6070 3157.0441 3164.3227 3170.9841 3172.5856 3178.8030
redmass: 1.1857 4.4301 2.6749 4.9243 2.4848 4.6364 2.2102 2.8283 2.5376 4.6540 4.6114 5.0730 6.3997 4.4769 4.6942 5.1490 3.8315 4.0853 3.9184 2.8412 3.4425 3.6646 3.6302 4.3124 4.6630 3.5367 5.2719 4.2730 3.3018 4.1653 3.4898 4.1137 4.9368 4.9006 5.6223 4.1579 3.3736 4.9313 1.8572 1.3589 2.6851 3.0083 4.0716 3.7133 1.9471 1.8777 3.7065 4.6652 1.4954 3.2286 3.5418 1.3685 1.3467 1.4018 1.9052 1.3610 1.5775 2.2323 2.7014 1.6555 1.6626 2.4352 2.1248 2.1108 3.0495 2.4606 1.6063 1.1856 1.3762 1.1918 2.4315 1.2380 1.9482 1.5545 1.8074 2.2341 2.2891 3.2024 1.4329 3.1643 2.9506 1.4591 4.7094 1.2510 2.2294 2.7840 4.1934 1.0671 1.0538 2.1479 1.3853 1.1671 1.5454 2.0685 1.4677 5.5798 5.6644 7.7833 5.9072 5.8423 6.3516 8.6776 1.0431 1.0366 1.0579 1.0961 1.0975 1.1066 1.0866 1.0928 1.0888 1.0860 1.0903 1.1011 1.0897 1.0978 1.0936 1.0944 1.0982 1.0950
irintensity: 1.7046 0.4319 0.5390 0.4127 1.6805 1.3631 0.1994 0.7809 1.2286 3.1213 4.1588 1.6286 4.0092 3.7581 0.1056 1.2310 1.0065 2.8703 0.4324 2.5178 2.2958 13.4995 0.2191 2.1088 3.3519 1.7565 1.7606 6.9428 5.3862 5.9231 1.7198 2.7468 4.3038 1.8309 0.4485 3.4531 6.4690 15.2410 18.6170 58.9793 29.8318 2.2036 16.1536 1.9933 60.9672 22.8296 25.7174 93.7560 5.6991 43.5652 6.5981 0.9284 2.3746 2.9331 102.9954 4.4726 1.7870 4.6099 6.7098 1.6528 7.6868 0.7204 9.6211 11.9720 1.9626 4.8785 0.1980 47.3394 1.0790 33.9951 293.9934 28.7096 5.5284 2.8595 5.3649 3.3227 3.7600 2.7478 3.8927 1.2646 5.1711 64.7196 3.7074 9.8222 2.8193 0.5728 3.4102 22.1209 19.1262 8.5978 9.7944 6.8240 18.6426 41.0615 25.0755 2.1219 0.2816 3.8092 0.9154 0.0991 1.9881 177.5116 30.6480 2.5363 13.8115 15.9148 6.1412 4.4199 1.1479 17.9458 7.3224 2.8282 24.4206 11.4561 14.6983 39.0609 7.6391 24.7674 47.1113 15.0335
temp: 298.150 k
press: 1.00000 atm
elementType: 8 8 6 6 6 6 6 6 6 6 6 6 6 6 6 6 6 6 6 6 6 6 6 6 1 1 1 1 1 1 1 1 1 1 1 1 1 1 1 1 1 1
symmnumber: 1
zpe: 876393.3 jmol-1
zpe.correction: 0.333801 hartree
zpe.thermalcorrener: 0.353979 hartree
zpe.thermalcorrenthalpy: 0.354923 hartree
zpe.thermalcorrgfe: 0.283574 hartree
zpe.sumelectzpe: -997.969303 hartree
zpe.sumelectthermal: -997.949124 hartree
zpe.sumelectthermalent: -997.948180 hartree
zpe.sumelectthermalfe: -998.019529 hartree
dipole: -1.3627 -1.1557 1.3714
dipole: 2.2524
quadrupole: -128.5106 -119.7952 -145.7298
quadrupole: -5.2732 5.9452 5.8722
quadrupole: 2.8346 11.5500 -14.3846 -5.2732 5.9452 5.8722
hfenergy: -998.3031032 hartree
pointgroup: C01 [X(C22H18O2)]
dipole: 0.2726122 -0.6448704 -0.543217 debye
polarizability: 413.4232857|-22.0654407|298.8208535|-3.0822204|2.342608|118.1840929 unknown
InChI: InChI=1S/C22H18O2/c1-14-17-8-5-6-10-20(17)21(13-24-15(2)23)22-18(14)12-11-16-7-3-4-9-19(16)22/h3-12H,13H2,1-2H3
charge 0 multiplicity 1
42 atoms
O  0.435677 2.690675 -0.217073
O  -0.847922 4.310346 0.880169
C  0.450867 -0.742107 0.06668
C  -0.184139 -2.050579 -0.073342
C  -0.382297 0.386364 0.326903
C  -1.596749 -2.18403 -0.191969
C  -1.81311 0.269386 0.203128
C  -2.424589 -1.015173 -0.115863
C  1.927195 -0.678176 -0.036878
C  2.697366 -1.894167 0.067425
C  0.64916 -3.240761 -0.021356
C  0.176371 1.677545 0.881015
C  2.01612 -3.169241 0.115731
C  -2.676318 1.411604 0.373868
C  -2.196516 -3.572177 -0.367363
C  -3.855182 -1.066765 -0.286145
C  2.6503 0.523806 -0.320888
C  4.12244 -1.851781 0.036834
C  -4.056288 1.316069 0.210586
C  -4.653721 0.063298 -0.132389
C  4.055451 0.543564 -0.370369
C  4.805066 -0.64294 -0.156537
C  -0.124211 3.966418 -0.082942
C  0.268001 4.832946 -1.260305
H  0.168467 -4.221444 -0.056645
H  -0.507877 2.149514 1.603581
H  1.152906 1.521447 1.362546
H  2.618146 -4.081446 0.202452
H  -2.251348 2.387835 0.621076
H  -3.274069 -3.546121 -0.577193
H  -1.716529 -4.116947 -1.20027
H  -2.061111 -4.18271 0.546167
H  -4.336817 -2.013484 -0.5427
H  2.11233 1.440229 -0.571313
H  4.677997 -2.791789 0.138662
H  -4.683612 2.204894 0.338031
H  -5.738151 -0.006037 -0.271164
H  4.572118 1.482839 -0.597069
H  5.899865 -0.61934 -0.18276
H  -0.034984 4.348773 -2.204429
H  1.364456 4.95787 -1.290995
H  -0.213457 5.81729 -1.171898
