program: Gaussian 09
title: 000160630
version: EM64L-G09RevD.01
frameworkgroup: C1[X(C7H15N2P)]
method: RPBEPBE
basis: SDD
operation: Freq
keyword: #p
keyword: freq=noraman
keyword: PBEPBE/SDD
title: #p freq=noraman PBEPBE/SDD
converged: YES YES NO NO
title: Mulliken charges:
elementType: P N N C C C C C C C H H H H H H H H H H H H H H H
charge: 0.676401 -0.399294 -0.403488 -0.394534 -0.419294 -0.414734 -0.405240 -0.691710 -0.341509 -0.671606 0.244810 0.222619 0.231729 0.244583 0.245490 0.228044 0.226447 0.246068 0.285683 0.228775 0.197042 0.227007 0.214945 0.215749 0.206018
chargesum: 0.00000
title: Mulliken charges with hydrogens summed into heavy atoms:
elementType: P N N C C C C C C C
charge: 0.676401 -0.399294 -0.403488 0.072895 0.057018 0.058799 0.067275 -0.177252 0.082540 -0.034894
polarizability: 1.34798921e+02 -3.03270642e+00 1.27665704e+02 -2.99482171e+00 -6.72729587e-01 8.30486155e+01
1716.lowfreq: -15.7932 -11.9759 -11.2829 -0.0012 0.0020 0.0023 16.9133 31.4545 46.8777
frequency: 16.8408 31.2512 46.8487 68.8263 89.3732 118.0358 189.1675 223.2207 226.0790 264.3496 275.4411 304.8289 321.8828 396.8053 510.3647 527.2141 706.7947 727.4708 764.2828 776.2411 793.5198 802.2540 839.1945 851.6972 866.1213 900.4526 964.7126 971.5484 1040.9359 1049.6135 1051.0886 1057.7119 1080.9458 1086.2442 1090.8225 1097.3266 1100.6185 1141.7987 1144.2681 1218.0937 1219.4426 1222.7437 1228.9087 1288.8374 1332.5151 1385.7783 1423.2420 1449.3991 1450.4749 1462.4117 1464.4196 1473.1286 1475.2383 1484.0392 2972.6297 2975.5425 2993.2779 3028.5246 3053.9913 3057.0036 3060.9590 3064.2878 3068.4386 3072.5076 3080.2398 3162.9329 3163.9868 3179.6594 3180.8229
redmass: 2.8231 3.2383 2.3266 2.0668 3.2042 2.7937 2.8514 1.2573 2.2583 3.5338 3.5280 3.7790 4.1575 3.7554 6.2670 6.3865 3.7881 1.1678 8.0402 8.5586 1.1025 1.0995 1.3097 3.8713 4.5258 2.0251 1.0558 1.0602 1.2620 2.2359 1.2652 1.2225 1.2950 1.2882 1.9037 1.5220 1.4299 1.3960 1.4002 1.4126 3.4060 3.1581 1.3208 1.0950 1.4341 1.2081 1.0836 1.0761 1.0758 1.1757 1.1742 1.0478 1.0502 1.0756 1.0371 1.0592 1.0589 1.0980 1.0504 1.0507 1.0618 1.0620 1.1009 1.0998 1.1027 1.1143 1.1148 1.1152 1.1155
irintensity: 2.5751 2.4901 0.0611 0.1114 0.4350 1.2238 3.3105 0.1900 1.3913 0.7589 1.3799 0.4633 0.3718 7.7450 10.8487 9.3253 9.1638 10.6071 3.2185 0.2440 29.7205 15.6961 6.6427 113.0012 52.2600 6.5302 0.0867 0.8913 3.5596 0.8088 3.0997 11.7485 6.0573 11.8870 13.5167 2.9463 2.6314 0.2832 0.6341 0.6158 24.9505 10.7294 0.5589 0.7624 0.3645 10.1081 8.3959 4.0388 8.7762 2.3916 5.5791 6.7860 8.2618 10.9930 44.9670 18.5887 20.2082 5.9198 19.2897 23.7987 57.6311 39.9649 15.8786 47.4121 59.2754 1.1082 1.1960 24.1721 28.1290
temp: 298.150 k
press: 1.00000 atm
elementType: 15 7 7 6 6 6 6 6 6 6 1 1 1 1 1 1 1 1 1 1 1 1 1 1 1
symmnumber: 1
zpe: 551536.3 jmol-1
zpe.correction: 0.210069 hartree
zpe.thermalcorrener: 0.223166 hartree
zpe.thermalcorrenthalpy: 0.224110 hartree
zpe.thermalcorrgfe: 0.168025 hartree
zpe.sumelectzpe: -725.547819 hartree
zpe.sumelectthermal: -725.534722 hartree
zpe.sumelectthermalent: -725.533778 hartree
zpe.sumelectthermalfe: -725.589864 hartree
dipole: 0.4420 0.0175 1.8467
dipole: 1.8990
quadrupole: -64.1500 -63.6891 -73.5044
quadrupole: -0.2614 0.5002 -0.1394
quadrupole: 2.9645 3.4254 -6.3899 -0.2614 0.5002 -0.1394
hfenergy: -725.7578885 hartree
pointgroup: C01 [X(C7H15N2P1)]
dipole: -0.165031 -0.0304148 0.7280194 debye
dipolederiv: 0.6079902 -0.1410994 -0.0336491 -0.082862 0.6852577 -0.0373074 0.0489492 0.0091012 0.2268636 -0.196715 0.0170547 0.0749927 0.0858466 -1.0993025 -0.0090158 0.0607613 -0.0987441 -0.2718219 -0.9620733 0.3731301 0.0111469 0.3333863 -0.365677 0.0383423 -0.0733723 0.0994418 -0.2985214 -0.0197784 0.0248362 -0.0031621 -0.0350309 0.2434805 0.1007719 0.0173134 -0.1005052 0.1616288 0.0130372 -0.0079481 -0.0965921 -0.0756026 0.2719003 0.0673685 -0.0537452 -0.1107769 0.1049168 0.2154192 -0.1460058 0.0464806 -0.1375173 0.0757279 -0.0840488 -0.1182866 0.0095334 0.1516656 0.2035868 -0.086415 0.0978924 -0.0769789 0.0106493 0.0046784 -0.0950928 0.0541903 0.1629726 -0.1749556 -0.0331152 0.014042 0.0050951 -0.0101786 0.0572811 0.0771487 0.1344552 -0.0625088 0.1061225 0.0343022 -0.0030057 -0.1367097 0.0322406 0.0303605 0.1258889 0.0856882 0.1336668 -0.0706082 -0.0891033 0.0374382 -0.0115671 0.07677 0.0286682 -0.0105009 0.0104926 0.0795361 0.0505266 -0.0938597 -0.0375817 -0.0473503 -0.0230464 -0.0834071 -0.0475942 -0.1006123 -0.0151301 -0.0467349 -0.071151 0.0844816 -0.0079901 0.0851483 -0.0475899 0.1165684 0.0462669 -0.0104495 0.0638822 0.0300498 -0.0272889 0.0239714 0.0961008 -0.0357338 -0.0731545 0.07141 -0.1109912 -0.0331515 0.1387288 0.0378816 0.111144 0.003427 -0.0297773 0.0472717 -0.0254144 0.0429427 0.0627259 0.0654892 -0.0343924 0.1017187 -0.0804907 0.0647034 -0.0329101 0.0793869 0.0200719 0.1041165 -0.0153652 -0.0664033 0.0169496 0.0171477 -0.044751 0.0200638 -0.1273887 -0.0822233 0.0540179 -0.0310241 -0.0110887 -0.0770483 0.0405736 0.0904964 0.1014948 0.0758645 -0.0638505 -0.0912692 -0.0368536 -0.0772633 -0.0778134 0.0856635 -0.0180542 -0.0891128 -0.0215918 0.0080453 0.0342853 -0.0299344 0.0049602 -0.0145136 0.0806689 0.0060478 0.0016816 0.0366276 -0.0784819 0.0366812 0.0171105 0.008284 0.0356223 -0.1291062 -0.0432154 0.0212378 -0.0559283 0.0663207 0.0417242 -0.0104834 0.0184816 -0.0014461 0.0655765 0.0154205 -0.0376184 0.0104844 -0.1851234 0.0621605 0.0237226 0.0085915 0.0496946 -0.1368013 -0.0331266 0.012859 -0.0478439 0.0578561 -0.2330032 0.0020881 -0.0473357 0.0500091 0.0615141 0.0305844 -0.0699554 0.025651 0.0757032 0.0931634 -0.0019033 -0.0365505 -0.0196302 0.0755621 -0.0114054 0.0262612 0.0172839 -0.1722162 0.0788498 0.0677494 0.0296403 -0.0113772 -0.1628063 -0.0572907 0.0238434 -0.0770724 0.059128 unknown
polarizability: 135.7198526|-1.3897594|126.8020403|2.5231333|0.6310502|82.9913479 unknown
InChI: InChI=1S/C7H15N2P/c1-2-7-10(8-3-4-8)9-5-6-9/h2-7H2,1H3
charge 0 multiplicity 1
25 atoms
P  -0.23919 0.092231 0.632192
N  0.155878 -1.384519 -0.433404
N  -1.610239 0.710946 -0.459465
C  -0.685742 -2.623634 -0.160642
C  0.749534 -2.579988 0.314652
C  -2.422247 1.866465 0.117994
C  -3.02673 0.479753 0.045355
C  1.098213 1.216856 -0.11365
C  2.526837 0.821271 0.319634
C  3.594185 1.764889 -0.279316
H  -0.949569 -3.187747 -1.060584
H  -1.475796 -2.573777 0.601439
H  0.925922 -2.495416 1.395568
H  1.527337 -3.111443 -0.242791
H  -2.704832 2.627457 -0.616143
H  -2.168002 2.25475 1.114384
H  -3.171645 -0.06061 0.991094
H  -3.746793 0.23817 -0.742781
H  0.975102 1.140814 -1.209173
H  0.866797 2.254877 0.195167
H  2.606464 0.831139 1.425815
H  2.728194 -0.216711 -0.008564
H  4.612142 1.466501 0.032721
H  3.558169 1.748351 -1.38446
H  3.430214 2.808975 0.047859
