program: Gaussian 09
title: 000160602
version: EM64L-G09RevD.01
frameworkgroup: C1[X(C9H9NO)]
method: RPBEPBE
basis: SDD
operation: Freq
keyword: #pfreq=noraman
keyword: PBEPBE/SDD
title: #p freq=noraman PBEPBE/SDD
converged: YES YES NO NO
title: Mulliken charges:
elementType: O N C C C C C C C C C H H H H H H H H H
charge: -0.195118 0.027364 -0.558468 0.482187 -0.415374 -0.386781 -0.392674 -0.227666 -0.224848 -0.236536 0.056717 0.230182 0.215575 0.232587 0.239538 0.236594 0.229335 0.230744 0.226185 0.230456
chargesum: 0.00000
title: Mulliken charges with hydrogens summed into heavy atoms:
elementType: O N C C C C C C C C C
charge: -0.195118 0.027364 -0.112711 0.482187 0.056751 -0.150187 -0.163339 0.003078 0.001337 -0.006079 0.056717
polarizability: 1.01367715e+02 -1.10112296e+01 1.17321310e+02 1.57946847e+01 8.27741637e+00 7.10499920e+01
1716.lowfreq: -6.7193 -3.3970 0.0006 0.0006 0.0009 16.0007 28.5046 44.1649 51.9822
frequency: 27.5002 44.1629 51.9170 113.8721 174.8295 250.0760 347.7080 403.6506 420.1295 488.6548 503.9202 528.2286 566.3451 618.0189 705.0933 744.0495 764.0789 771.9070 853.8722 908.5508 948.3377 954.2725 976.5549 990.2207 996.0904 1020.5233 1028.0151 1088.6425 1173.0722 1182.1629 1188.8047 1213.9613 1241.8755 1313.4620 1331.4653 1354.5152 1383.7014 1416.9126 1441.1832 1464.1135 1476.8880 1485.9287 1594.0813 1615.0606 2309.5620 2981.6631 2995.9654 3047.0832 3061.5343 3112.1565 3120.0296 3133.8419 3147.1399 3165.1887
redmass: 4.8321 7.0561 5.8547 6.2254 2.6557 4.6519 2.2562 2.8116 3.2686 4.0519 12.0157 10.5636 2.8010 6.2845 1.8083 3.0605 2.0479 3.2167 1.2494 1.4470 2.0637 2.6173 1.3911 6.1964 1.3203 2.1132 2.1471 1.5854 1.0645 1.1518 1.1187 2.4154 1.1642 1.3241 1.2548 1.3395 7.4438 5.7221 2.1338 1.1305 1.1775 2.1353 6.0290 6.1627 12.4223 1.0626 1.0616 1.0994 1.1022 1.0878 1.0876 1.0902 1.0955 1.1014
irintensity: 0.4264 0.7181 1.1622 1.0634 11.6839 1.0984 1.3788 0.0089 2.0890 12.7290 14.6733 23.4550 20.1174 0.0692 48.4234 34.6999 23.2738 4.8476 0.3861 4.3390 14.7924 5.5412 0.0592 0.1424 0.1200 10.1003 5.0909 11.0138 0.0800 0.4920 0.9014 0.1190 12.2148 9.2541 2.9866 14.1003 0.4048 3.1472 8.4849 10.9145 8.8114 14.0590 1.3840 3.1938 662.7403 35.7422 30.2803 37.8798 22.3122 9.9070 8.2219 9.2779 37.3493 18.3524
temp: 298.150 k
press: 1.00000 atm
elementType: 8 7 6 6 6 6 6 6 6 6 6 1 1 1 1 1 1 1 1 1
symmnumber: 1
zpe: 414150.6 jmol-1
zpe.correction: 0.157742 hartree
zpe.thermalcorrener: 0.167834 hartree
zpe.thermalcorrenthalpy: 0.168778 hartree
zpe.thermalcorrgfe: 0.119991 hartree
zpe.sumelectzpe: -477.540799 hartree
zpe.sumelectthermal: -477.530707 hartree
zpe.sumelectthermalent: -477.529763 hartree
zpe.sumelectthermalfe: -477.578550 hartree
dipole: -1.4692 -3.3024 0.2800
dipole: 3.6253
quadrupole: -66.4307 -63.2969 -62.6925
quadrupole: -9.3970 4.4296 3.8309
quadrupole: -2.2907 0.8431 1.4476 -9.3970 4.4296 3.8309
hfenergy: -477.698541 hartree
pointgroup: C01 [X(C9H9N1O1)]
dipole: -0.6565659 1.2661425 -0.010183 debye
dipolederiv: -0.3316763 0.2013611 -0.0080476 0.3029746 -1.3202944 0.0809208 -0.0243926 0.0135432 -0.2565919 -0.5048475 -0.0966198 -0.0404893 0.3515816 -1.4676971 0.0782346 -0.10506 0.101703 -0.3483731 0.0009089 -0.0070158 -0.0338864 0.0241086 0.0316946 -0.007716 -0.1012378 -0.0606483 0.1114118 0.1248662 0.1185822 -0.0695985 0.1649739 0.0344062 -0.0208318 -0.0853449 0.0037008 -0.0617366 0.4307587 -0.1292185 0.010278 -0.3481681 0.7799236 -0.008635 0.0818453 0.0135731 0.3021117 -0.0931484 -0.0294803 -0.1075229 -0.0528472 -0.1018369 0.0651887 -0.0921446 0.0419942 -0.0226632 -0.1655498 0.0022016 -0.027949 0.0059536 0.0245035 0.0863913 -0.0146452 0.1113098 -0.087069 -0.0786497 0.0230095 -0.0372289 0.0517299 0.0930556 0.0941237 -0.0315473 0.086801 -0.0440252 -0.0233923 -0.0021516 -0.1168576 -0.0215244 -0.0358028 0.0664382 -0.1307661 0.0595759 0.010288 -0.0441147 0.1078797 -0.0741453 0.1018085 -0.0170249 -0.0206589 -0.0646773 -0.0224715 -0.101961 0.4195343 -0.0854809 0.0099213 -0.4020439 2.1418853 -0.1299755 0.0772944 -0.0886706 0.2910032 0.0224683 -0.0381661 0.0534292 -0.01165 0.0746349 -0.0825698 0.0573076 0.001711 -0.1095558 0.0017571 0.0976231 -0.0027214 0.0143681 -0.1494024 0.0300097 0.0021064 -0.0149228 0.0837345 -0.0908526 -0.1227636 0.0258237 -0.060183 -0.0925014 0.0303452 0.016926 0.0603034 0.0853614 0.0482423 0.1270257 0.0556573 0.0677407 -0.0198542 -0.003006 0.0368748 -0.0684934 -0.1065278 0.0280017 0.0171554 0.1284115 0.0087847 0.0774424 -0.029315 0.1255909 -0.0348136 0.0060057 0.1161033 -0.0575938 0.00839 -0.0417628 -0.0824845 -0.0944263 0.0128081 -0.0775756 0.0758337 0.1089753 -0.0269415 0.0218314 -0.0522751 -0.0636431 -0.0960702 0.0186328 -0.0951773 0.0752786 0.024441 0.0129808 0.1274495 0.0162837 0.080424 -0.0611431 0.1377667 -0.0553601 -0.0019647 0.0061742 -0.112387 0.0772552 -0.1198534 0.0125716 0.0226956 0.0826628 0.0239179 0.0994398 unknown
polarizability: 96.9319513|11.275406|118.0536681|-18.3144818|7.7660256|74.7533981 unknown
InChI: InChI=1S/C9H9NO/c11-8-10-7-6-9-4-2-1-3-5-9/h1-5H,6-7H2
charge 0 multiplicity 1
20 atoms
O  2.509585 -2.091364 0.10506
N  2.385188 0.34025 0.031692
C  0.414056 1.646145 -0.818859
C  -0.686377 0.689549 -0.38709
C  1.670029 1.594934 0.103342
C  -0.840125 -0.578231 -1.003985
C  -1.561016 1.037404 0.676029
C  -1.838123 -1.47952 -0.567254
C  -2.560499 0.141057 1.114089
C  -2.700997 -1.122782 0.493645
C  2.365522 -0.877829 0.084103
H  0.734005 1.434356 -1.855417
H  0.046308 2.690143 -0.79339
H  2.367699 2.400187 -0.189859
H  1.363477 1.784077 1.151613
H  -0.178486 -0.860691 -1.832291
H  -1.463877 2.019426 1.157202
H  -1.938787 -2.456405 -1.0528
H  -3.23058 0.426904 1.932814
H  -3.475501 -1.819811 0.832355
