program: Gaussian 09
title: 000160566
version: EM64L-G09RevD.01
frameworkgroup: C1[X(C21H13NO)]
method: RPBEPBE
basis: SDD
operation: Freq
keyword: #p
keyword: freq=noraman
keyword: PBEPBE/SDD
title: #p freq=noraman PBEPBE/SDD
converged: NO YES NO NO
title: Mulliken charges:
elementType: O N C C C C C C C C C C C C C C C C C C C C C H H H H H H H H H H H H H
charge: -0.327279 -0.128599 0.280243 0.280254 0.106999 0.106959 -0.402966 0.239645 0.239644 0.416403 0.416403 -0.419361 -0.419344 -0.460174 -0.460174 -0.382778 -0.382782 -0.438835 -0.438835 -0.265938 -0.265933 -0.243540 -0.243543 0.225693 0.305867 0.305872 0.245110 0.245110 0.222907 0.222910 0.245913 0.245912 0.231181 0.231181 0.232937 0.232938
chargesum: 0.00000
title: Mulliken charges with hydrogens summed into heavy atoms:
elementType: O N C C C C C C C C C C C C C C C C C C C C C
charge: -0.327279 -0.128599 0.280243 0.280254 0.106999 0.106959 -0.177273 0.239645 0.239644 0.416403 0.416403 -0.113494 -0.113472 -0.215064 -0.215064 -0.159870 -0.159872 -0.192922 -0.192924 -0.034757 -0.034753 -0.010603 -0.010605
polarizability: 4.63167680e+02 7.88798743e-04 2.98716711e+02 7.51212131e-05 -2.14393888e-02 8.65644364e+01
1716.lowfreq: -7.3648 -0.0008 0.0003 0.0009 4.8921 6.6064 43.7534 55.6572 95.2724
frequency: 43.7471 55.6572 95.2699 112.4675 116.7157 158.6062 213.4451 233.3125 246.4367 286.4605 296.5816 317.7739 344.0209 381.4794 410.7827 430.0263 440.5121 481.6296 505.5169 519.8577 521.2186 522.3795 561.2574 564.3105 590.4790 600.7160 610.2452 626.7304 649.8449 667.2969 724.5759 729.2089 760.2039 765.9497 772.7804 785.0709 794.7938 801.6854 838.2032 847.9510 855.7211 872.4755 877.3181 888.9229 889.9624 931.7327 959.4330 961.0167 970.8720 990.3600 991.1514 999.9258 1001.2425 1038.0978 1040.8846 1068.8066 1096.6015 1143.5455 1147.9905 1177.3053 1177.8849 1189.4010 1221.7052 1232.2537 1247.2787 1249.5236 1251.1384 1266.3119 1271.8068 1306.8213 1313.8851 1365.5598 1397.5016 1407.2761 1410.2323 1418.9084 1427.6409 1451.5578 1456.9442 1458.5895 1496.2000 1528.8879 1547.8287 1566.5221 1581.5641 1604.4818 1609.7119 1622.2310 1626.1926 3125.2705 3125.2917 3134.5941 3134.7946 3136.3604 3136.4906 3149.5957 3150.1397 3165.5834 3165.8813 3187.3302 3188.6433 3189.3075
redmass: 4.4315 4.6305 7.6745 4.2906 5.5412 3.8482 4.2752 5.9132 5.4847 3.4568 6.9424 4.7756 11.2682 5.6583 3.0608 3.0820 5.0717 4.0014 7.1316 6.0412 7.6075 3.5078 2.7509 3.4626 7.3887 6.7938 4.1001 7.3416 6.5093 3.9962 5.8575 2.6182 1.3099 1.3817 6.1285 2.4014 3.0887 6.3834 1.4231 1.7003 4.3905 1.7619 4.6262 1.7410 1.7509 7.3909 1.3909 1.3871 3.9561 1.3338 1.3354 1.3396 1.3415 2.2196 2.3261 2.9621 1.9694 1.3379 1.3823 1.2696 1.0902 1.5604 2.2822 1.6362 2.2783 2.3202 1.8276 4.0246 1.9314 1.9936 2.4114 5.4032 8.3072 2.1740 5.3350 2.4644 2.7909 4.1069 3.0482 2.6005 3.4530 4.3805 6.9807 5.0734 8.1904 6.5375 6.5768 6.2438 6.6776 1.0861 1.0861 1.0890 1.0890 1.0897 1.0896 1.0946 1.0942 1.1006 1.1005 1.0888 1.0944 1.0946
irintensity: 0.0000 1.0009 0.6202 0.0000 0.3651 3.5238 0.0000 2.5785 0.1043 3.1556 0.3623 0.0000 2.0928 2.6229 0.0000 13.1365 11.7360 8.1518 0.0611 0.0045 3.7872 0.0000 7.0456 0.0000 11.1691 0.0719 0.0254 0.8980 3.5599 0.0000 2.0071 5.6283 0.0000 134.3414 0.0020 0.0791 0.0000 1.1322 0.0000 96.8723 0.6248 17.6800 4.0139 0.0001 32.0910 14.5589 0.0000 11.1122 1.0168 0.0000 0.8298 0.0000 0.3670 5.5348 2.6565 20.2283 8.0817 0.0673 4.4955 0.0301 7.0578 0.6031 8.5805 0.0071 4.1580 48.8443 0.0131 88.5418 11.3910 8.8324 28.7322 0.4800 0.3679 1.8142 4.2797 6.6298 11.4064 0.2800 2.7554 6.7960 31.2775 10.9807 2.5655 7.6554 10.6002 6.8296 7.7063 0.5269 3.1109 1.7934 3.3281 0.2588 0.3415 26.7516 6.0907 6.7633 53.3525 33.6370 29.2334 6.6642 17.9603 1.0519
temp: 298.150 k
press: 1.00000 atm
elementType: 8 7 6 6 6 6 6 6 6 6 6 6 6 6 6 6 6 6 6 6 6 6 6 1 1 1 1 1 1 1 1 1 1 1 1 1
symmnumber: 1
zpe: 723882.4 jmol-1
zpe.correction: 0.275712 hartree
zpe.thermalcorrener: 0.291576 hartree
zpe.thermalcorrenthalpy: 0.292521 hartree
zpe.thermalcorrgfe: 0.232634 hartree
zpe.sumelectzpe: -936.498464 hartree
zpe.sumelectthermal: -936.482600 hartree
zpe.sumelectthermalent: -936.481655 hartree
zpe.sumelectthermalfe: -936.541542 hartree
dipole: -0.0001 -4.0530 0.0003
dipole: 4.0530
quadrupole: -100.6278 -128.2675 -140.6680
quadrupole: -0.0003 0.0001 -0.0014
quadrupole: 22.5600 -5.0797 -17.4802 -0.0003 0.0001 -0.0014
hfenergy: -936.7741759 hartree
pointgroup: C01 [X(C21H13N1O1)]
dipole: 0.0000144 -1.5945913 -0.0001246 debye
polarizability: 463.1676796|-0.0052334|298.7167115|0.0000757|0.0214394|86.5644364 unknown
InChI: InChI=1S/C21H13NO/c23-22-20-11-9-14-5-1-3-7-16(14)18(20)13-19-17-8-4-2-6-15(17)10-12-21(19)22/h1-13H
charge 0 multiplicity 1
36 atoms
O  -0.000014 3.489617 0.000502
N  0.000028 2.1544 0.00027
C  1.231919 0.016416 0.00011
C  -1.231931 0.016465 0.000116
C  1.221994 1.454433 0.00026
C  -1.221939 1.454482 0.000249
C  -0.00002 -0.680025 0.000033
C  2.538722 -0.654905 0.000072
C  -2.538778 -0.654786 0.000091
C  3.74291 0.139975 0.000215
C  -3.742921 0.140164 0.000207
C  2.429095 2.227481 0.000395
C  -2.428995 2.227595 0.000364
C  3.651822 1.583345 0.00038
C  -3.651753 1.583532 0.000345
C  2.670318 -2.075783 -0.000093
C  -2.670456 -2.075658 -0.000037
C  5.016674 -0.506572 0.000182
C  -5.016719 -0.506311 0.000175
C  3.9307 -2.691387 -0.000119
C  -3.930872 -2.691186 -0.000068
C  5.116337 -1.903053 0.000014
C  -5.116464 -1.902788 0.000044
H  -0.000037 -1.770399 -0.000026
H  2.331833 3.315012 0.0005
H  -2.331672 3.315126 0.000455
H  4.581053 2.164815 0.000502
H  -4.580953 2.165052 0.000439
H  1.778526 -2.710156 -0.000213
H  -1.778703 -2.710084 -0.000119
H  5.920638 0.113934 0.000289
H  -5.920651 0.114246 0.000267
H  4.002878 -3.784445 -0.000252
H  -4.003112 -3.78424 -0.000174
H  6.097859 -2.389017 -0.000005
H  -6.098015 -2.388693 0.00003
