program: Gaussian 09
title: 000160543
version: EM64L-G09RevD.01
frameworkgroup: C1[X(C15H20N2O2)]
method: RPBEPBE
basis: SDD
operation: Freq
keyword: #p
keyword: freq=noraman
keyword: PBEPBE/SDD
title: #p freq=noraman PBEPBE/SDD
converged: YES YES NO NO
title: Mulliken charges:
elementType: O O N N C C C C C C C C C C C C C C C H H H H H H H H H H H H H H H H H H H H
charge: -0.439983 -0.293218 -0.072168 -0.219374 -0.131608 -0.090442 -0.253972 -0.546549 -0.411808 -0.478635 -0.417059 -0.447645 0.500618 -0.069812 -0.441425 -0.443207 0.132013 -0.149726 -0.346738 0.219981 0.224564 0.234381 0.236073 0.234878 0.195287 0.228714 0.221958 0.229300 0.255298 0.259081 0.221835 0.216047 0.185301 0.228837 0.192951 0.234540 0.331519 0.228221 0.241972
chargesum: 0.00000
title: Mulliken charges with hydrogens summed into heavy atoms:
elementType: O O N N C C C C C C C C C C C C C C C
charge: -0.108465 -0.293218 -0.072168 -0.219374 0.088372 0.134122 -0.019591 -0.075597 0.012192 -0.027377 0.097319 -0.009763 0.500618 0.115489 -0.019636 -0.208667 0.132013 0.078495 -0.104766
polarizability: 2.10804019e+02 5.88506962e+00 1.69358066e+02 1.42080423e+01 -8.29633045e+00 1.38677983e+02
1716.lowfreq: -12.2492 -8.0551 -5.9839 -0.0005 0.0005 0.0007 43.3767 66.4360 73.7198
frequency: 43.2121 66.3693 73.7094 125.5043 174.4075 182.2643 202.4198 227.2325 242.9976 288.3897 294.9356 317.6950 341.7735 353.7972 362.4205 396.7861 435.4772 447.2810 461.9488 478.0391 489.8756 501.9639 530.4590 586.5790 594.3500 608.6175 639.7476 696.0155 716.4782 730.3005 768.1730 791.8085 803.6660 818.9608 852.9340 869.1215 877.6409 889.8741 923.7206 930.4851 942.2509 952.6297 973.6646 977.0415 1006.1277 1019.1498 1030.6540 1046.5309 1057.5076 1059.8544 1071.0504 1094.7249 1104.3154 1119.1195 1125.4512 1139.4497 1154.9280 1167.7351 1180.7882 1189.1637 1206.0120 1212.5414 1229.8216 1236.2552 1251.1281 1266.2733 1271.3158 1282.5504 1303.6789 1310.7974 1321.7073 1328.9113 1335.7641 1339.7776 1348.3222 1353.5405 1354.4167 1365.8904 1376.5984 1390.3136 1396.7057 1430.8107 1459.0329 1460.2143 1468.1952 1474.6988 1482.1202 1484.5931 1547.7906 1560.1216 1644.7819 2848.9177 2917.8929 2948.1539 2971.3350 2978.4870 2994.6657 2997.7460 2999.8014 3016.7121 3020.9308 3029.8738 3038.9169 3053.0456 3054.7853 3057.2571 3062.0362 3132.6918 3164.4046 3182.3984 3546.9032
redmass: 4.9670 5.1980 5.6022 3.0230 3.6591 3.2017 3.6974 5.0910 3.0387 2.4303 1.2450 3.1027 3.3059 2.5833 2.1924 4.0162 4.3168 3.7505 2.3892 3.3988 3.2099 4.1283 5.3603 3.1594 3.5928 3.6025 4.7327 4.3034 3.0562 2.5447 3.3645 1.9722 1.9326 3.0847 1.4862 2.2830 3.0422 2.6096 1.9415 2.0204 2.7398 2.2328 1.9195 1.3065 3.0545 2.9693 2.1040 2.3056 2.3839 2.2859 2.1031 2.1392 1.4074 1.6896 1.5713 1.5751 1.6523 2.5004 1.2840 1.7643 1.5040 1.6446 1.6040 1.3004 1.2556 1.3171 1.3449 1.6497 1.6958 1.4231 1.3984 1.2434 1.5254 1.4114 1.4600 1.4879 1.4386 1.5405 1.3976 1.6477 2.1525 1.7367 1.0853 1.0871 1.1017 1.1011 1.2818 1.1865 6.4081 7.4771 7.5786 1.0710 1.0835 1.0837 1.0632 1.0624 1.0681 1.0603 1.0616 1.0802 1.0870 1.0854 1.0992 1.1013 1.1012 1.1012 1.1021 1.0884 1.0936 1.0966 1.0659
irintensity: 0.8814 1.8107 3.9443 0.9655 1.4656 4.4647 1.7438 0.8068 2.4264 19.3564 117.3592 13.7453 5.3587 0.6620 7.6148 3.0593 1.2685 3.4746 5.5262 1.0758 2.9641 0.9035 2.6364 0.5051 25.4411 15.6137 0.2064 2.1389 7.8969 10.3417 11.1974 63.5017 2.5865 2.7320 2.3935 1.7847 0.5998 4.8385 2.1086 0.6602 21.9280 4.0585 21.9195 1.0102 62.9722 5.2508 7.1759 5.2782 3.0062 18.8815 13.3163 30.3030 8.1932 43.8533 12.5415 5.9140 26.0371 26.8149 11.5079 2.5831 28.2825 1.7054 11.6429 4.4146 10.8101 22.6414 13.0006 11.5826 4.2161 8.9604 8.7180 30.3956 4.7494 3.6971 6.5935 6.2549 11.5355 11.0980 4.3919 6.3814 3.4443 15.0354 4.6484 11.9549 15.3339 7.9321 6.7114 15.2520 117.7678 172.4850 227.5600 92.3341 43.8002 30.9452 31.0060 61.4749 9.6515 1.4260 22.5689 52.1635 37.0059 29.6150 38.8037 26.2733 15.2750 39.6734 50.1711 19.9060 8.6307 8.1133 1.4774
temp: 298.150 k
press: 1.00000 atm
elementType: 8 8 7 7 6 6 6 6 6 6 6 6 6 6 6 6 6 6 6 1 1 1 1 1 1 1 1 1 1 1 1 1 1 1 1 1 1 1 1
symmnumber: 1
zpe: 867658.7 jmol-1
zpe.correction: 0.330474 hartree
zpe.thermalcorrener: 0.346005 hartree
zpe.thermalcorrenthalpy: 0.346949 hartree
zpe.thermalcorrgfe: 0.288513 hartree
zpe.sumelectzpe: -842.115590 hartree
zpe.sumelectthermal: -842.100059 hartree
zpe.sumelectthermalent: -842.099115 hartree
zpe.sumelectthermalfe: -842.157551 hartree
dipole: 3.6798 -3.6421 1.1872
dipole: 5.3118
quadrupole: -122.4923 -112.7496 -112.1684
quadrupole: 9.6582 -15.6568 4.1367
quadrupole: -6.6889 3.0538 3.6350 9.6582 -15.6568 4.1367
hfenergy: -842.4460639 hartree
pointgroup: C01 [X(C15H20N2O2)]
dipole: 1.4499373 1.4351319 -0.4532292 debye
polarizability: 211.0454596|-5.7523126|169.3679445|-13.6119336|-8.3174379|138.4266642 unknown
InChI: InChI=1S/C15H20N2O2/c18-12-4-5-16-8-10-6-11(14(16)7-12)9-17-13(10)2-1-3-15(17)19/h1-3,10-12,14,18H,4-9H2
charge 0 multiplicity 1
39 atoms
O  5.239319 -0.334988 -0.076018
O  -3.199203 -2.029558 1.159421
N  1.081523 0.536161 0.564623
N  -1.872223 -0.541457 -0.090061
C  0.408849 -1.370891 -0.909311
C  1.468306 -0.819535 0.083576
C  -0.353247 0.929052 -1.436535
C  0.159177 -0.382693 -2.070474
C  0.7553 1.500703 -0.50561
C  2.921235 -0.856322 -0.483226
C  -0.932962 -1.69623 -0.221075
C  2.0314 1.039598 1.581457
C  -1.646456 0.697395 -0.669073
C  3.912229 -0.339589 0.571332
C  3.508198 1.060213 1.080545
C  -2.592263 1.712385 -0.523106
C  -3.063288 -0.854963 0.679111
C  -3.778591 1.476237 0.236582
C  -4.005891 0.236985 0.822445
H  0.802294 -2.327052 -1.304999
H  1.452511 -1.480853 0.977253
H  -0.554656 1.685371 -2.216857
H  -0.583771 -0.798335 -2.776644
H  1.086059 -0.191912 -2.641261
H  1.627056 1.771325 -1.153784
H  0.39974 2.432596 -0.027813
H  3.198027 -1.889098 -0.767082
H  3.020257 -0.228366 -1.388656
H  -1.474792 -2.484098 -0.778452
H  -0.77882 -2.101998 0.79433
H  1.958765 0.38363 2.472718
H  1.716654 2.051514 1.895216
H  3.920655 -1.044031 1.436036
H  3.627008 1.787288 0.253938
H  4.176378 1.381438 1.905593
H  -2.407113 2.679766 -0.997659
H  5.910397 -0.000123 0.572778
H  -4.515695 2.279112 0.352742
H  -4.904364 0.023122 1.4074
