program: Gaussian 09
title: 000160534
version: EM64L-G09RevD.01
frameworkgroup: C1[X(C4H6O3)]
method: RPBEPBE
basis: SDD
operation: Freq
keyword: #p
keyword: freq=noraman
keyword: PBEPBE/SDD
title: #p freq=noraman PBEPBE/SDD
converged: YES YES YES YES
title: Mulliken charges:
elementType: O O O C C C C H H H H H H
charge: -0.436564 -0.387330 -0.243194 -0.224641 -0.016788 0.165891 -0.552607 0.255966 0.244635 0.360269 0.224355 0.223911 0.386097
chargesum: 0.00000
title: Mulliken charges with hydrogens summed into heavy atoms:
elementType: O O O C C C C
charge: -0.076296 -0.001233 -0.243194 0.031324 0.227848 0.165891 -0.104341
polarizability: 6.60645029e+01 -9.53026473e+00 5.17139545e+01 -4.91400817e+00 5.47308006e+00 4.06719049e+01
1716.lowfreq: -6.1626 -4.6657 -0.0010 -0.0007 -0.0004 10.9346 45.9390 78.6161 213.4905
frequency: 45.9227 78.6105 213.4892 244.5559 315.5046 362.0136 387.2992 448.3584 575.3428 625.8133 653.1039 711.6430 846.0803 940.3739 961.3831 991.0913 1004.6971 1065.3475 1124.3911 1221.1834 1260.1241 1294.9874 1310.6710 1383.6896 1425.8698 1640.2154 1655.6099 3077.7393 3094.6017 3113.8941 3204.5740 3488.9432 3509.5499
redmass: 8.5231 3.0647 2.5456 4.2022 3.1111 1.3400 2.6985 3.3776 1.3977 4.4537 1.7449 3.4896 2.7266 2.1183 1.3056 5.0363 1.1627 2.3000 2.3447 1.2492 1.3967 1.2278 1.6057 1.4501 1.1854 7.6012 4.9892 1.0859 1.0608 1.0945 1.1148 1.0653 1.0641
irintensity: 2.8616 0.2448 3.4397 17.8385 6.2838 123.0558 28.3677 8.7823 108.9388 14.9190 65.4376 55.9801 20.2267 16.6060 91.6926 172.9909 9.9412 159.0056 0.8674 25.0538 35.9479 9.3353 54.8377 17.0409 7.7493 212.1132 23.6094 7.1578 9.7923 7.6871 19.4361 27.7690 27.0730
temp: 298.150 k
press: 1.00000 atm
elementType: 8 8 8 6 6 6 6 1 1 1 1 1 1
symmnumber: 1
zpe: 252870.7 jmol-1
zpe.correction: 0.096313 hartree
zpe.thermalcorrener: 0.104049 hartree
zpe.thermalcorrenthalpy: 0.104993 hartree
zpe.thermalcorrgfe: 0.063701 hartree
zpe.sumelectzpe: -381.115115 hartree
zpe.sumelectthermal: -381.107380 hartree
zpe.sumelectthermalent: -381.106436 hartree
zpe.sumelectthermalfe: -381.147728 hartree
dipole: -0.0062 -2.4961 0.5543
dipole: 2.5569
quadrupole: -38.9338 -42.4031 -40.9708
quadrupole: 1.4483 2.2604 2.0558
quadrupole: 1.8354 -1.6338 -0.2016 1.4483 2.2604 2.0558
hfenergy: -381.2114287 hartree
pointgroup: C01 [X(C4H6O3)]
dipole: -0.0322589 0.9756753 0.2428871 debye
dipolederiv: -0.560071 0.0802498 0.1988193 0.16923 -0.7405241 -0.0387509 0.2463531 -0.0026887 -0.33124 -0.3278755 -0.1263165 0.1242694 -0.151366 -1.1363337 0.2788034 0.1024869 0.2142632 -0.4200259 -0.7940869 0.202469 -0.2471307 -0.0672738 -0.7003049 0.1068061 -0.2891746 0.2570973 -0.4868584 0.1454755 -0.2177938 -0.1197155 -0.1358341 0.5781674 0.0510465 -0.1302481 0.0254431 0.2679418 -0.018312 -0.0705352 -0.0308538 -0.2023017 -0.1903213 -0.0926958 -0.166942 -0.1393126 0.067532 1.0224971 -0.0045049 0.3216444 0.320153 1.2981781 -0.4084783 0.403568 -0.4865132 0.485742 -0.1682562 -0.0882923 -0.0697262 -0.0900291 -0.2779448 -0.0973467 -0.0224656 -0.0927796 0.0814456 0.0614528 0.0360717 -0.0392401 0.0089924 0.0174718 0.0611224 -0.0057309 0.0591154 -0.0435885 0.0471787 0.0634573 -0.0241089 0.0306093 0.1208816 0.0856582 0.0321062 0.068353 -0.0636165 0.30966 0.0755231 -0.1160193 0.0013225 0.3938653 -0.0240939 -0.1175053 0.0184079 0.1826299 -0.0016324 0.0710823 0.1013317 0.0907915 0.1677876 0.0057747 0.1096674 0.0046155 0.0122422 0.1113669 0.0344262 0.0224351 0.0323568 0.1355918 0.0664916 -0.0156204 0.0820924 -0.0778887 0.1726028 -0.0558367 -0.1217055 -0.006651 0.3334852 0.0056627 -0.1464948 -0.0080938 0.3256846 unknown
polarizability: 66.8843788|-9.1373922|51.2632164|4.5815512|-4.9089674|40.302767 unknown
InChI: InChI=1S/C4H6O3/c1-2-3(5)4(6)7/h2-3,5-6H,1H2
charge 0 multiplicity 1
13 atoms
O  -0.014331 -1.842127 -0.622751
O  1.108203 1.615187 -0.520772
O  1.922565 -0.261041 0.590508
C  -0.251517 -0.39994 -0.553667
C  -1.379653 -0.071467 0.414353
C  1.037689 0.29603 -0.100773
C  -2.495064 0.616477 0.07373
H  -0.511322 -0.063594 -1.569894
H  -1.246568 -0.462139 1.433382
H  0.676385 -2.070894 0.057686
H  -3.291774 0.808717 0.800535
H  -2.645192 1.006863 -0.940074
H  1.936578 2.043627 -0.171262
