program: Gaussian 09
title: 000160531
version: EM64L-G09RevD.01
frameworkgroup: C1[X(C19H26O2)]
method: RPBEPBE
basis: SDD
operation: Freq
keyword: #pfreq=noraman
keyword: PBEPBE/SDD
title: #p freq=noraman PBEPBE/SDD
converged: YES YES NO NO
title: Mulliken charges:
elementType: O O C C C C C C C C C C C C C C C C C C C H H H H H H H H H H H H H H H H H H H H H H H H H H
charge: -0.179080 -0.202704 -0.150153 -0.111726 -0.160253 0.310925 0.282641 -0.530718 -0.520755 -0.530867 -0.497309 0.466834 0.042399 -0.512514 -0.501597 -0.795664 -0.446647 -0.828192 -0.730481 -0.547123 0.215592 0.240747 0.206748 0.215751 0.227104 0.204898 0.214060 0.225503 0.233301 0.218498 0.220367 0.215706 0.248325 0.247476 0.219590 0.211753 0.241410 0.233206 0.228658 0.218208 0.228634 0.220700 0.227837 0.256202 0.238623 0.238915 0.245171
chargesum: 0.00000
title: Mulliken charges with hydrogens summed into heavy atoms:
elementType: O O C C C C C C C C C C C C C C C C C C C
charge: -0.179080 -0.202704 0.090593 0.095022 0.055498 0.310925 0.282641 -0.098716 -0.081193 -0.079068 -0.061236 0.466834 0.042399 -0.016712 -0.070254 -0.092390 -0.228440 -0.151021 -0.235655 -0.063037 0.215592
polarizability: 2.41148044e+02 -4.23208307e+00 1.88753504e+02 6.66321186e-01 2.40444771e-01 1.57289983e+02
1716.lowfreq: -15.4445 -0.0009 -0.0009 -0.0006 5.6505 12.8279 33.8005 55.8968 57.7713
frequency: 33.4940 55.8669 57.6882 81.8873 128.2230 144.6189 158.9145 175.6197 206.9576 223.2579 234.3872 248.5289 262.3149 271.0863 273.2880 288.6417 298.8514 329.9184 358.8938 371.2878 386.8894 408.0558 424.2236 449.1436 472.1511 489.7938 507.4852 515.1902 539.9438 550.9080 566.2887 573.3164 606.1608 644.1803 678.5510 702.7616 710.2183 755.5611 794.7649 814.7345 819.9220 828.1673 838.9551 870.9627 878.7295 907.3304 916.6536 931.3961 942.5334 965.7500 977.3490 984.8910 992.2855 1000.9388 1010.3912 1027.1326 1029.3387 1049.1937 1070.0672 1073.4548 1083.8428 1103.9173 1112.9258 1123.8158 1128.7576 1134.2033 1139.8488 1159.3101 1165.7864 1184.2678 1189.5559 1199.5954 1210.2168 1223.0552 1237.4339 1247.5728 1250.8151 1256.6358 1261.1463 1266.1756 1286.0135 1292.4452 1297.0671 1316.5278 1322.1102 1329.2786 1329.7390 1334.6576 1338.2051 1352.4352 1355.7628 1369.2293 1383.1207 1390.1931 1427.7875 1429.8535 1433.8805 1458.3601 1461.3605 1469.8879 1472.6913 1475.1707 1480.8964 1484.1252 1489.3928 1495.1902 1638.9582 1654.9172 1691.5019 2901.3852 2919.0254 2926.4631 2954.9667 2973.0719 2974.2415 2976.4982 2979.0943 2985.1309 2990.0384 2994.4587 2996.6952 2999.7839 3005.2634 3038.2729 3050.1351 3056.3304 3059.1546 3062.8570 3065.0486 3066.9137 3071.3406 3079.0058 3081.0772 3085.0218 3088.5105
redmass: 7.0649 5.2300 3.4346 3.8746 3.9274 2.2532 3.1990 2.3179 1.3436 1.8924 2.6920 2.1377 2.2621 2.1392 1.9803 2.7190 2.8907 2.2693 2.4010 2.3129 3.4907 3.5643 3.3784 3.4109 3.0470 3.0723 2.9521 2.5203 2.3900 2.7194 3.3319 3.7438 3.8319 3.8591 2.7426 3.2494 2.9834 3.4164 1.6460 2.1996 1.7727 1.8721 1.9284 1.7851 1.9358 2.0813 1.9312 1.7495 2.0128 1.8424 1.8896 2.1415 2.0412 2.0354 2.2050 2.4073 1.7900 2.1948 2.7965 2.0995 1.7414 1.4567 2.4524 2.4600 2.4473 2.2328 1.5762 1.6089 1.9160 1.7086 2.1199 1.5630 1.7285 1.9073 1.9690 1.4632 1.4754 1.6036 1.5391 1.7677 1.4244 1.2969 1.3951 1.4789 1.3940 1.3387 1.5083 1.5913 1.3548 1.4455 1.5410 1.4795 1.1866 1.2113 1.0800 1.0877 1.0846 1.0876 1.0731 1.0775 1.0818 1.0648 1.0534 1.0671 1.0782 1.0663 10.6527 12.0440 7.8751 1.0808 1.0811 1.0672 1.0666 1.0805 1.0656 1.0383 1.0617 1.0373 1.0640 1.0648 1.0711 1.0730 1.0675 1.0986 1.1014 1.0986 1.0960 1.0983 1.0945 1.0929 1.1019 1.0991 1.0987 1.0995 1.0904
irintensity: 3.4147 3.8079 1.1953 3.4841 2.1153 0.8554 0.3074 0.0483 0.0333 0.4174 0.4800 0.3354 2.2528 0.4613 0.4338 0.9355 3.0762 0.4227 3.7185 2.3324 2.2859 1.7615 0.9277 2.5553 1.8833 5.4551 0.6256 0.5700 1.6362 1.0906 3.5150 3.3801 2.1565 4.8901 5.2513 3.1681 2.4483 0.3332 4.8675 3.6325 9.6317 3.1973 8.1123 6.1522 0.9094 2.7574 4.6198 2.4719 1.6058 3.9727 18.7042 0.3140 8.7894 4.6774 26.6610 14.9109 17.2414 15.9681 5.3406 5.7519 14.8964 3.8826 6.2891 1.7623 31.6114 9.0769 3.6248 11.1033 16.4681 0.8262 18.3163 3.6841 13.4232 10.9673 12.4132 6.3777 1.7207 2.0456 1.5697 1.1260 1.2787 2.2645 4.7991 6.8727 0.4221 0.7164 0.9017 3.2567 0.6034 0.1978 0.7279 2.3592 22.8023 19.5132 18.0489 2.0898 39.2642 8.8154 2.1686 11.8776 4.6841 7.3472 1.6551 17.4919 9.0583 11.9808 245.1254 185.8035 7.8180 12.7386 19.7654 36.8046 17.0337 9.1181 7.5625 15.4047 30.9747 12.3050 19.0603 58.3207 17.6438 40.7589 33.4586 26.3158 42.7140 9.8730 24.2700 51.4317 22.6462 3.4241 42.7433 15.6004 41.2644 26.6879 37.1325
temp: 298.150 k
press: 1.00000 atm
elementType: 8 8 6 6 6 6 6 6 6 6 6 6 6 6 6 6 6 6 6 6 6 1 1 1 1 1 1 1 1 1 1 1 1 1 1 1 1 1 1 1 1 1 1 1 1 1 1
symmnumber: 1
zpe: 1066045.6 jmol-1
zpe.correction: 0.406035 hartree
zpe.thermalcorrener: 0.425292 hartree
zpe.thermalcorrenthalpy: 0.426236 hartree
zpe.thermalcorrgfe: 0.359970 hartree
zpe.sumelectzpe: -888.459883 hartree
zpe.sumelectthermal: -888.440626 hartree
zpe.sumelectthermalent: -888.439682 hartree
zpe.sumelectthermalfe: -888.505949 hartree
dipole: -1.0436 0.9720 2.4688
dipole: 2.8512
quadrupole: -172.1007 -122.6731 -127.6001
quadrupole: -15.5015 1.7134 -1.9998
quadrupole: -31.3094 18.1182 13.1912 -15.5015 1.7134 -1.9998
hfenergy: -888.8659183 hartree
pointgroup: C01 [X(C19H26O2)]
dipole: -0.4072478 -0.417298 -0.9582845 debye
polarizability: 241.0671907|4.6800897|188.8163655|-0.8302014|-0.7853509|157.3079748 unknown
InChI: InChI=1S/C19H26O2/c1-18-9-7-13(20)11-12(18)3-4-14-15-5-6-17(21)19(15,2)10-8-16(14)18/h3,14-16H,4-11H2,1-2H3
charge 0 multiplicity 1
47 atoms
O  -4.967731 1.001638 1.040987
O  5.528934 -0.239264 1.196359
C  -0.560968 -0.76044 -0.414837
C  0.234863 0.507667 0.050351
C  -1.949442 -0.748741 0.254847
C  -2.776571 0.529653 -0.063064
C  1.658854 0.580538 -0.622027
C  -0.596481 1.814388 -0.136417
C  -2.020532 1.757533 0.480842
C  -2.947852 -1.915943 0.025618
C  0.202256 -2.061232 -0.071509
C  2.357747 -0.788694 -0.511248
C  -4.123537 0.184803 0.601904
C  -4.267935 -1.35617 0.632141
C  2.569516 1.644009 0.106204
C  -3.115578 0.703251 -1.579118
C  1.695899 -1.952395 -0.273351
C  1.565262 0.972832 -2.128864
C  3.876079 -0.750056 -0.550166
C  3.43669 1.04572 1.239069
C  4.404761 -0.000505 0.687585
H  -0.686729 -0.716971 -1.516291
H  0.408022 0.379694 1.144913
H  -1.75846 -0.719676 1.354761
H  -0.684285 2.044998 -1.214574
H  -0.056688 2.669235 0.313432
H  -1.950653 1.683319 1.584803
H  -2.569553 2.69157 0.257733
H  -2.627595 -2.851531 0.515345
H  -3.064912 -2.132116 -1.052985
H  -0.20211 -2.903446 -0.668775
H  0.008662 -2.335112 0.990489
H  -4.394222 -1.663266 1.688575
H  -5.187139 -1.668181 0.104331
H  1.944415 2.458927 0.511284
H  3.242384 2.116914 -0.636277
H  -3.745869 1.601072 -1.710029
H  -2.205119 0.830073 -2.188985
H  -3.67106 -0.160092 -1.987359
H  2.276117 -2.882175 -0.176463
H  1.277655 2.033216 -2.253079
H  2.544365 0.839073 -2.625215
H  0.834004 0.346856 -2.669608
H  4.330335 -1.755184 -0.579401
H  4.246887 -0.203566 -1.444494
H  2.789099 0.540527 1.986333
H  4.010516 1.817753 1.781431
