program: Gaussian 09
title: 000160485
version: EM64L-G09RevD.01
frameworkgroup: C1[X(C16H20O6)]
method: RPBEPBE
basis: SDD
operation: Freq
keyword: #pfreq=noraman
keyword: PBEPBE/SDD
title: #p freq=noraman PBEPBE/SDD
converged: YES YES NO NO
title: Mulliken charges:
elementType: O O O O O O C C C C C C C C C C C C C C C C H H H H H H H H H H H H H H H H H H H H
charge: -0.494808 -0.443919 -0.293161 -0.254595 -0.248870 -0.202427 0.284339 -0.108350 -0.616587 0.246620 -0.740643 -0.752502 0.048654 0.232371 0.280963 0.175723 -0.585654 -0.254693 -0.326420 0.114352 -0.524159 -0.536367 0.259570 0.279796 0.214795 0.218792 0.198056 0.265804 0.218672 0.246896 0.209038 0.353072 0.342207 0.275397 0.268569 0.249772 0.229960 0.222468 0.237992 0.233851 0.247438 0.227989
chargesum: 0.00000
title: Mulliken charges with hydrogens summed into heavy atoms:
elementType: O O O O O O C C C C C C C C C C C C C C C C
charge: -0.152601 -0.090847 -0.293161 -0.254595 -0.248870 -0.202427 0.284339 0.151219 -0.121995 0.246620 -0.057991 -0.077897 0.048654 0.232371 0.280963 0.175723 -0.310257 0.013875 -0.076648 0.114352 0.166262 0.172911
polarizability: 2.96642479e+02 -1.64283869e+01 2.13338758e+02 2.57873536e+01 -4.58658891e+00 1.24149306e+02
1716.lowfreq: -11.9752 -7.5889 -0.0008 -0.0007 0.0007 4.8818 22.3684 34.0158 36.6953
frequency: 21.2204 34.0023 36.6586 70.4321 77.8228 88.3541 95.3981 107.5250 145.6123 150.7843 152.6417 169.8118 191.4044 214.3097 220.3508 223.3139 243.8643 251.1923 277.7358 281.0239 285.3128 308.7533 318.9171 339.5451 345.5710 370.5976 378.0108 398.7383 426.9298 437.4062 443.1156 456.8785 475.8917 509.7530 535.2337 567.4942 597.2851 621.6968 634.1483 648.2890 672.8152 699.0074 734.6794 752.6569 782.3543 817.1803 835.6045 841.6627 854.5897 857.6913 898.6309 917.1064 921.5337 925.2754 969.9520 984.8440 992.8959 998.2391 1037.8159 1046.6486 1056.6319 1087.8488 1102.6346 1109.5018 1112.3129 1147.1935 1154.0567 1162.5289 1164.9578 1188.4864 1202.9474 1218.7686 1252.9490 1266.5772 1294.3531 1300.0506 1320.6011 1335.5293 1361.6656 1375.1791 1383.0261 1393.8660 1400.6505 1421.3894 1437.8454 1448.0135 1452.1974 1456.7480 1457.5343 1462.4421 1469.9201 1470.7201 1475.0308 1478.9496 1483.8578 1489.7960 1553.6741 1597.2581 1616.6878 1688.3167 2960.6033 2971.7384 2973.3503 2980.4701 3025.4899 3048.3218 3050.5396 3062.1631 3065.0205 3069.5843 3092.6101 3097.7538 3104.6530 3117.9416 3132.1060 3152.1074 3187.1751 3189.0236 3525.3168 3577.3720
redmass: 4.1579 4.4683 5.2554 3.2306 3.5132 4.8457 5.5750 4.2272 4.3165 1.0708 3.5849 4.2461 4.6390 1.4075 1.5311 1.6184 1.8015 1.4298 1.6557 2.6237 2.9379 3.6945 2.9741 5.0810 2.5046 2.8330 3.8614 5.1484 3.5181 5.8410 1.6561 3.4625 5.0735 3.5717 3.7243 3.1466 5.9913 6.4936 4.1238 4.6097 4.5288 6.0497 8.9780 5.0935 3.5992 4.8702 1.7434 2.2734 2.3466 4.4023 4.2164 2.1742 1.5345 2.8161 5.8550 1.4614 1.3082 2.6353 3.0033 3.6083 4.2889 1.3985 3.2335 1.2512 1.2596 1.3645 1.8650 1.4502 1.4354 1.5895 1.9930 2.3718 2.1203 1.5288 3.3217 1.4668 1.4742 1.6681 3.5260 1.2231 1.2245 1.2357 3.3881 1.9245 1.2422 1.8171 1.0907 1.0614 1.0672 1.0613 1.1251 1.2434 1.0723 1.0736 2.1448 1.0694 9.1825 7.5231 8.2198 10.9407 1.0313 1.0323 1.0382 1.0368 1.0585 1.1041 1.0872 1.0975 1.1043 1.0978 1.1015 1.0987 1.0986 1.1012 1.1007 1.0892 1.0961 1.0913 1.0643 1.0663
irintensity: 0.3775 0.3360 0.8133 7.0191 3.0851 2.4946 5.7415 1.3502 2.5740 0.1044 1.5314 3.1724 2.1544 4.6809 12.3964 8.5073 30.0415 73.8847 14.2136 3.9657 3.9909 12.0751 14.1570 1.6060 3.3251 1.6485 4.4153 3.4536 0.1561 17.7997 144.9521 72.9473 7.4058 93.1018 2.8111 12.4336 4.5954 6.5562 3.1693 0.2125 3.0724 4.2657 26.3083 25.3746 12.8277 5.0390 67.3336 10.7107 23.7024 32.2495 17.8971 12.9382 1.4236 28.7736 22.6162 3.3394 0.9681 3.5955 94.6894 114.2300 124.7883 52.5090 163.7270 2.4300 0.0431 6.1992 2.1462 33.5366 48.6575 30.2022 10.5197 23.6374 11.1241 12.2915 112.3281 17.2321 43.9906 19.1753 94.3907 32.0893 15.1613 28.2116 16.9480 11.0255 5.4156 36.8053 7.9291 1.6220 15.4399 5.0825 31.6405 50.2911 4.7499 4.9659 0.1229 25.2063 51.0349 47.5156 505.6187 557.2566 55.5617 59.1929 27.8448 29.6199 21.5637 40.6950 4.7949 5.0049 34.1227 71.4484 12.3301 23.2045 12.6333 25.1649 18.6075 4.5876 2.6708 0.8473 15.6337 3.5940
temp: 298.150 k
press: 1.00000 atm
elementType: 8 8 8 8 8 8 6 6 6 6 6 6 6 6 6 6 6 6 6 6 6 6 1 1 1 1 1 1 1 1 1 1 1 1 1 1 1 1 1 1 1 1
symmnumber: 1
zpe: 872856.7 jmol-1
zpe.correction: 0.332454 hartree
zpe.thermalcorrener: 0.355491 hartree
zpe.thermalcorrenthalpy: 0.356435 hartree
zpe.thermalcorrgfe: 0.280128 hartree
zpe.sumelectzpe: -1071.350819 hartree
zpe.sumelectthermal: -1071.327782 hartree
zpe.sumelectthermalent: -1071.326838 hartree
zpe.sumelectthermalfe: -1071.403145 hartree
dipole: -7.1351 -1.6403 -3.1731
dipole: 7.9793
quadrupole: -150.7355 -105.6022 -132.8589
quadrupole: -8.2880 -5.4030 0.4638
quadrupole: -21.0033 24.1300 -3.1267 -8.2880 -5.4030 0.4638
hfenergy: -1071.6832729 hartree
pointgroup: C01 [X(C16H20O6)]
dipole: -2.7992082 -0.8322489 -1.1519634 debye
polarizability: 298.9177666|-11.480076|211.4620105|23.1325459|-7.7132949|123.7507649 unknown
InChI: InChI=1S/C16H20O6/c1-16(2,19)13(17)7-10-11(20-3)8-12-9(15(10)21-4)5-6-14(18)22-12/h5-6,8,13,17,19H,7H2,1-4H3
charge 0 multiplicity 1
42 atoms
O  -4.721758 0.613216 -0.274767
O  -2.487945 0.870221 1.306578
O  0.026672 -2.281555 -0.293023
O  -1.011786 2.374066 -0.998813
O  3.566942 1.099366 0.006346
O  5.759331 0.551071 0.489384
C  -4.219656 -0.632534 0.384271
C  -2.689818 -0.356683 0.527575
C  -1.959536 -0.265955 -0.843907
C  -0.493515 0.067399 -0.664269
C  -4.864335 -0.778893 1.777653
C  -4.533659 -1.850162 -0.508709
C  0.456248 -0.929726 -0.387792
C  -0.029207 1.424694 -0.709994
C  1.834002 -0.635329 -0.136894
C  2.237396 0.727776 -0.213116
C  1.326106 1.7597 -0.501846
C  2.822416 -1.619387 0.227608
C  4.136946 -1.263075 0.451888
C  4.602936 0.114075 0.335511
C  0.225919 -3.06455 -1.532099
C  -0.610615 3.785032 -1.053941
H  -2.231512 -1.15646 1.134987
H  -2.459722 0.501617 -1.45836
H  -2.055466 -1.240746 -1.351622
H  -4.528082 -1.709976 2.269316
H  -5.968375 -0.824923 1.698338
H  -4.578196 0.071766 2.417726
H  -3.984418 -2.746684 -0.164956
H  -4.259118 -1.647997 -1.557428
H  -5.61443 -2.084371 -0.477862
H  -2.950506 1.591034 0.80186
H  -5.704031 0.660244 -0.164147
H  1.696732 2.785933 -0.537373
H  2.501442 -2.658839 0.350947
H  4.895424 -1.995778 0.737749
H  1.294044 -3.088646 -1.822255
H  -0.366158 -2.640009 -2.366002
H  -0.12419 -4.082156 -1.301051
H  -0.208295 4.120094 -0.079616
H  -1.533459 4.334809 -1.28842
H  0.13983 3.95562 -1.848973
