program: Gaussian 09
title: 000160483
version: EM64L-G09RevD.01
frameworkgroup: C1[X(C16H10O7)]
method: RPBEPBE
basis: SDD
operation: Freq
keyword: #pfreq=noraman
keyword: PBEPBE/SDD
title: #p freq=noraman PBEPBE/SDD
converged: YES YES NO NO
title: Mulliken charges:
elementType: O O O O O O O C C C C C C C C C C C C C C C C H H H H H H H H H H
charge: -0.374606 -0.292769 -0.190178 -0.372029 -0.415992 -0.382271 -0.232431 0.022551 0.331883 0.169025 0.360600 0.040479 -0.282923 0.057024 -0.674601 0.408258 0.084832 0.216622 -0.618021 0.361012 -0.819726 -0.569236 0.067883 0.294741 0.295470 0.238312 0.235060 0.273548 0.255144 0.389677 0.367088 0.372607 0.382969
chargesum: 0.00000
title: Mulliken charges with hydrogens summed into heavy atoms:
elementType: O O O O O O O C C C C C C C C C C C C C C C C
charge: 0.015071 -0.292769 -0.190178 -0.004942 -0.043385 0.000698 -0.232431 0.022551 0.331883 0.169025 0.360600 0.040479 -0.282923 0.057024 -0.379860 0.408258 0.084832 0.216622 -0.322552 0.361012 -0.072806 -0.314092 0.067883
polarizability: 3.80583008e+02 1.12650115e+00 2.30675356e+02 3.62565569e+00 -7.26144510e-01 8.68896047e+01
1716.lowfreq: -6.9183 0.0002 0.0005 0.0007 3.2122 3.3240 33.0117 44.4123 54.3576
frequency: 33.0115 44.4075 54.3540 70.4175 112.3831 121.0113 129.1284 142.7723 174.6415 190.4235 211.1674 229.0384 245.1982 257.8081 262.7555 295.1669 323.3454 328.0110 369.6071 405.2943 414.6268 421.4659 422.4691 435.1789 446.5563 460.0142 479.2832 517.3207 535.4758 547.6850 552.9022 582.6075 593.6842 597.9541 617.6435 635.2875 671.8787 698.3844 708.4099 741.0116 754.7643 769.4442 781.6290 838.8458 847.4776 899.3274 908.6502 937.5661 971.2049 992.8467 994.9930 998.9691 1030.3163 1048.8360 1079.7534 1084.7229 1138.5154 1156.0936 1177.5072 1186.3571 1208.8373 1239.8381 1279.0955 1316.9579 1328.4108 1332.8129 1362.2911 1389.9712 1396.1883 1405.9283 1425.1535 1441.2037 1458.1713 1461.5887 1475.6267 1479.8406 1540.3686 1555.9631 1572.4453 1594.5365 1606.5717 1629.7529 1635.9833 2562.5212 2991.1246 3072.0004 3105.0903 3136.0518 3147.3084 3159.4933 3503.7777 3536.6958 3580.2853
redmass: 9.4381 7.5008 7.3834 8.3241 3.7333 5.4391 1.3698 6.2592 5.7753 5.6511 4.6107 7.5435 8.9085 4.1673 5.2295 6.3827 4.9972 6.2927 7.0773 7.4446 1.1403 7.3954 6.3817 1.1809 6.4000 7.9255 4.7712 4.9855 4.5764 4.7623 3.8555 4.5891 3.0394 5.5966 3.7114 3.0592 4.4288 5.3449 5.9296 6.1643 6.2246 7.6488 7.6584 2.9850 1.7012 1.5295 6.9170 1.8404 6.4964 2.0756 1.3383 2.8415 3.0712 1.6089 3.0014 2.6589 1.8985 1.5511 2.4295 1.4284 1.7684 1.8329 2.2531 4.3964 4.5593 6.2845 4.6401 4.0214 3.5521 1.5759 7.1116 4.2960 3.9120 1.1089 1.1591 3.8560 7.3144 3.9022 5.6420 6.7741 4.6334 7.8126 6.8809 1.0739 1.0379 1.0958 1.1003 1.0921 1.0925 1.0918 1.0639 1.0658 1.0662
irintensity: 2.0681 0.6275 4.0061 0.5609 0.3693 0.7907 0.2648 1.3006 0.0501 0.1756 2.1690 4.4415 1.7161 4.2475 0.3725 1.4775 14.6066 16.9251 7.3553 2.9839 63.5369 11.2196 0.5015 204.8854 24.8293 4.5691 4.7533 5.9648 5.1148 80.5996 45.3983 15.1992 27.9893 12.3423 5.7848 59.2883 20.3046 7.8064 4.8543 7.8735 2.2097 28.6488 7.2868 23.7546 19.9212 8.4119 35.4901 29.4958 29.2497 17.1728 121.9710 53.2065 324.1563 22.5592 57.9528 84.9652 296.4647 156.1913 39.8101 24.2095 3.2766 24.7545 327.2955 156.0742 23.4784 535.6207 197.6461 109.8604 4.2688 18.6595 3.0374 24.4164 190.4554 23.4029 43.8048 27.4574 321.8791 74.6665 29.1632 164.2556 93.7843 235.7895 174.7995 298.5617 11.1215 8.8499 13.8366 7.9221 4.1051 1.1723 38.8742 45.5390 95.9935
temp: 298.150 k
press: 1.00000 atm
elementType: 8 8 8 8 8 8 8 6 6 6 6 6 6 6 6 6 6 6 6 6 6 6 6 1 1 1 1 1 1 1 1 1 1
symmnumber: 1
zpe: 595797.0 jmol-1
zpe.correction: 0.226927 hartree
zpe.thermalcorrener: 0.246356 hartree
zpe.thermalcorrenthalpy: 0.247300 hartree
zpe.thermalcorrgfe: 0.179255 hartree
zpe.sumelectzpe: -1140.700260 hartree
zpe.sumelectthermal: -1140.680831 hartree
zpe.sumelectthermalent: -1140.679887 hartree
zpe.sumelectthermalfe: -1140.747932 hartree
dipole: 4.4177 1.2168 1.1326
dipole: 4.7201
quadrupole: -105.5100 -128.1249 -134.9254
quadrupole: -4.0422 -8.0966 -0.3745
quadrupole: 17.3434 -5.2714 -12.0720 -4.0422 -8.0966 -0.3745
hfenergy: -1140.927187 hartree
pointgroup: C01 [X(C16H10O7)]
dipole: 1.7438495 0.4867691 0.413133 debye
polarizability: 380.6238244|0.2002134|230.2857541|1.8847865|-7.4325868|87.2383904 unknown
InChI: InChI=1S/C16H10O7/c1-5-2-7-12(14(20)10(5)16(22)23)15(21)11-8(13(7)19)3-6(17)4-9(11)18/h2-4,17-18,20,22H,1H3
charge 0 multiplicity 1
33 atoms
O  -2.157112 -2.184248 0.006305
O  0.313113 -2.498774 0.016264
O  1.101227 2.967223 -0.059676
O  2.955366 -2.854678 0.058283
O  5.81108 1.01509 0.004523
O  -4.675104 -1.364016 1.13574
O  -5.362233 -0.266334 -0.78666
C  -0.61222 -0.296104 0.00964
C  -0.449252 1.117922 -0.022139
C  1.901769 -0.659314 0.01273
C  2.086236 0.763065 -0.010003
C  0.537969 -1.21912 0.014152
C  0.916912 1.708352 -0.033145
C  -1.945979 -0.836159 0.028021
C  -1.570713 1.968374 -0.051167
C  -2.891648 1.450957 -0.036648
C  -3.073557 0.042407 0.027116
C  3.085176 -1.472788 0.033334
C  3.366623 1.346892 -0.013657
C  4.508849 0.516532 0.006531
C  -4.072254 2.400391 -0.074547
C  4.370656 -0.88453 0.030111
C  -4.458973 -0.527339 0.043057
H  -1.398883 3.048462 -0.081313
H  3.432542 2.441087 -0.032875
H  -4.750071 2.240084 0.78426
H  -3.733747 3.448521 -0.055364
H  -4.676852 2.235839 -0.983615
H  5.276043 -1.501877 0.045613
H  -1.206105 -2.631125 0.008885
H  3.846857 -3.290095 0.073011
H  5.818195 2.004683 -0.01281
H  -5.58711 -1.760382 1.068942
