program: Gaussian 09
title: 000160477
version: EM64L-G09RevD.01
frameworkgroup: C1[X(C20H16O6)]
method: RPBEPBE
basis: SDD
operation: Freq
keyword: #pfreq=noraman
keyword: PBEPBE/SDD
title: #p freq=noraman PBEPBE/SDD
converged: YES YES NO NO
title: Mulliken charges:
elementType: O O O O O O C C C C C C C C C C C C C C C C C C C C H H H H H H H H H H H H H H H H
charge: -0.239857 -0.234357 -0.211645 -0.224949 -0.300725 -0.296353 -0.312192 -0.127221 0.355105 -0.364421 0.052631 0.232228 0.173473 0.110793 -0.557053 0.139250 -0.531929 -0.366473 0.212380 0.170184 0.243392 -0.374593 -0.363740 -0.169200 -0.528813 -0.531002 0.272753 0.249167 0.245148 0.209172 0.293054 0.275390 0.282434 0.259550 0.279431 0.267857 0.248011 0.224360 0.229211 0.258748 0.221965 0.228834
chargesum: 0.00000
title: Mulliken charges with hydrogens summed into heavy atoms:
elementType: O O O O O O C C C C C C C C C C C C C C C C C C C C
charge: -0.239857 -0.234357 -0.211645 -0.224949 -0.300725 -0.296353 -0.039439 0.121946 0.355105 0.089900 0.052631 0.232228 0.173473 0.110793 -0.263999 0.139250 -0.256539 -0.084039 0.212380 0.170184 0.243392 -0.115042 -0.084309 0.098657 0.172768 0.178544
polarizability: 2.78007338e+02 3.64161149e-01 2.25776110e+02 2.05994186e+01 -1.67613691e+01 2.08448790e+02
1716.lowfreq: -7.5003 -2.5482 -0.0006 0.0004 0.0005 9.1285 18.4146 35.6249 58.0024
frequency: 18.3222 35.5900 57.9929 63.2119 91.6089 102.3643 113.8973 127.8293 141.5760 162.0900 169.9957 187.0872 196.8915 217.7230 248.6488 252.7551 257.1336 283.1549 300.4639 305.0741 328.0555 343.7837 356.8913 386.7534 434.2848 442.5780 457.7205 463.1827 494.8377 517.6464 531.2762 585.6921 590.5256 597.4819 619.6608 630.5492 654.1461 667.1681 695.9834 715.3525 728.3655 739.4272 744.4834 758.2695 779.1916 789.4105 793.9731 825.0836 853.2196 873.3556 875.2428 876.8895 888.0475 918.7930 928.8746 946.0451 954.8193 959.7106 972.4962 982.0455 1016.7372 1037.2215 1072.9723 1091.6171 1110.3245 1114.3857 1115.9800 1121.9231 1142.5778 1151.4457 1159.2582 1160.2250 1174.1510 1201.0862 1211.0236 1232.8344 1240.9167 1243.9102 1257.4572 1278.0077 1288.1629 1311.2372 1328.6377 1339.5930 1363.4779 1374.0228 1386.3833 1417.7263 1424.1656 1429.9693 1443.0793 1454.8547 1457.8252 1459.0201 1465.2671 1477.1335 1482.9172 1488.1599 1516.2360 1563.3908 1577.8606 1593.0349 1621.6574 1623.7285 2969.4289 2973.5193 2981.9245 2988.2073 3002.7318 3064.9673 3071.8712 3098.8386 3119.0409 3122.7965 3154.3044 3158.3658 3178.0522 3187.4882 3238.5383 3272.1357
redmass: 6.7324 4.8811 4.2674 4.2952 6.0829 2.9006 7.7393 5.6389 3.6832 1.0934 1.1534 3.7761 5.5252 5.3505 5.3407 4.1060 4.6333 6.8041 5.4744 4.8870 4.7213 5.0071 5.8370 7.0995 7.2275 5.8084 7.1194 4.7244 4.1685 5.6892 5.1144 4.4955 5.1210 5.9412 7.1460 5.6347 5.7345 6.9114 5.2739 6.0511 4.7276 3.0826 2.7166 2.2374 4.5055 5.1845 3.7792 1.7454 7.1104 1.6599 2.3428 1.6836 4.8586 1.8934 2.0808 3.7434 4.9021 3.1277 1.3653 4.0565 3.1794 4.4149 3.4048 1.8254 3.0716 1.2734 1.2617 1.5093 1.7292 1.5460 1.5825 1.6065 2.6075 2.5222 1.3506 1.2924 2.4084 1.2479 1.4662 3.5976 2.5925 2.2976 2.0525 2.0113 2.7716 2.7008 2.4608 6.0599 1.1858 3.7154 1.3042 1.1353 1.0585 1.0695 5.8787 1.0606 3.1231 1.0540 5.2050 9.7675 9.8991 9.5167 8.3011 8.1140 1.0306 1.0312 1.0699 1.0827 1.0828 1.1043 1.1035 1.0972 1.1024 1.1031 1.0918 1.0893 1.0923 1.0968 1.0918 1.1086
irintensity: 0.3843 0.6430 0.9983 4.8606 0.6861 8.3797 2.5367 0.4473 6.0210 0.1644 0.4478 2.1381 9.1479 0.8831 8.1237 8.0636 3.9708 3.1880 2.1055 0.9668 0.5302 2.0020 0.1205 2.2081 5.3443 12.5413 5.6855 31.1220 4.6558 2.2587 2.0459 3.0194 13.5549 11.5769 2.0411 3.7148 15.4692 6.2097 4.2746 7.9754 2.0305 17.2365 9.8044 59.7839 29.4516 10.1439 12.8403 31.6936 0.9367 13.2956 15.0959 2.1834 22.3255 7.6766 29.2932 12.4749 84.0562 41.4328 0.6800 10.5353 72.5893 42.5845 109.8765 3.9535 40.3704 15.0084 4.0160 31.6484 127.8740 16.8799 13.1318 57.6597 35.4997 51.2089 28.9569 3.2821 9.8922 19.2638 30.2526 41.6395 22.0112 17.8754 248.0883 21.4700 52.8311 8.1876 13.9927 76.6435 2.1382 33.6450 10.9297 16.1935 11.4826 18.3693 30.2155 3.7400 261.0789 17.2534 3.9533 8.2451 236.9118 103.0389 43.5420 73.1729 69.4369 81.0636 17.9160 11.4673 89.0613 29.1345 23.8142 13.9575 27.2962 23.1442 0.9466 2.1920 0.2347 3.0032 2.6804 0.0482
temp: 298.150 k
press: 1.00000 atm
elementType: 8 8 8 8 8 8 6 6 6 6 6 6 6 6 6 6 6 6 6 6 6 6 6 6 6 6 1 1 1 1 1 1 1 1 1 1 1 1 1 1 1 1
symmnumber: 1
zpe: 829242.6 jmol-1
zpe.correction: 0.315842 hartree
zpe.thermalcorrener: 0.337514 hartree
zpe.thermalcorrenthalpy: 0.338458 hartree
zpe.thermalcorrgfe: 0.264853 hartree
zpe.sumelectzpe: -1221.173702 hartree
zpe.sumelectthermal: -1221.152031 hartree
zpe.sumelectthermalent: -1221.151087 hartree
zpe.sumelectthermalfe: -1221.224691 hartree
dipole: -0.9461 1.8651 -1.1055
dipole: 2.3655
quadrupole: -134.9675 -134.8158 -156.2691
quadrupole: -6.1996 2.6921 9.6788
quadrupole: 7.0500 7.2016 -14.2516 -6.1996 2.6921 9.6788
hfenergy: -1221.4895443 hartree
pointgroup: C01 [X(C20H16O6)]
dipole: 0.3619082 -0.8385692 -0.1788486 debye
polarizability: 278.594696|-6.9621737|234.1983953|-17.8669535|8.6425741|199.4391473 unknown
InChI: InChI=1S/C20H16O6/c1-22-15-7-12-14(8-16(15)23-2)25-9-17-18(12)19(21)11-3-4-13-10(5-6-24-13)20(11)26-17/h3-8,17-18H,9H2,1-2H3
charge 0 multiplicity 1
42 atoms
O  1.54161 -1.618359 0.468275
O  -1.100487 -2.837566 0.342193
O  0.385697 1.728192 2.736185
O  4.845898 0.800955 -1.839752
O  -3.770573 2.10016 -0.275945
O  -4.551043 -0.278592 -1.795222
C  -0.161136 -0.529996 1.982013
C  0.706126 -1.77161 1.694654
C  -1.323612 -0.434726 0.983888
C  -0.154914 -3.009677 1.454071
C  0.696722 0.752415 1.989832
C  1.832473 0.778544 1.045885
C  -1.725071 -1.576017 0.238144
C  2.166208 -0.387709 0.298671
C  -2.031695 0.773921 0.784713
C  3.191949 -0.308814 -0.675329
C  -2.802022 -1.508729 -0.671671
C  2.554822 1.998979 0.836632
C  -3.097626 0.861348 -0.128812
C  3.864296 0.932912 -0.844233
C  -3.500158 -0.301251 -0.852497
C  3.584475 2.103241 -0.108072
C  3.790914 -1.24425 -1.610007
C  4.768088 -0.547191 -2.286889
C  -3.567573 2.738004 -1.59808
C  -5.879986 0.077651 -1.241898
H  -0.569116 -0.633408 3.007236
H  1.4033 -1.953033 2.538381
H  0.466337 -3.871859 1.165359
H  -0.713997 -3.247414 2.381936
H  -1.749954 1.675918 1.337742
H  -3.105518 -2.399576 -1.227553
H  2.255869 2.860381 1.44224
H  4.136047 3.031005 -0.274609
H  3.516839 -2.28597 -1.75541
H  5.470402 -0.808829 -3.073271
H  -3.917511 2.076937 -2.412174
H  -2.497448 2.978884 -1.744179
H  -4.16047 3.665097 -1.572285
H  -5.848983 1.061614 -0.74159
H  -6.20998 -0.698775 -0.525878
H  -6.558198 0.101093 -2.108294
