program: Gaussian 09
title: 000160476
version: EM64L-G09RevD.01
frameworkgroup: C1[X(C15H8O6)]
method: RPBEPBE
basis: SDD
operation: Freq
keyword: #pfreq=noraman
keyword: PBEPBE/SDD
title: #p freq=noraman PBEPBE/SDD
converged: YES YES NO NO
title: Mulliken charges:
elementType: O O O O O O C C C C C C C C C C C C C C C H H H H H H H H
charge: -0.336262 -0.159702 -0.196629 -0.373985 -0.370414 -0.342073 0.140505 0.387904 0.251483 0.272928 -0.156507 -0.213561 0.045682 -0.665355 -0.041915 0.249632 -0.373039 -0.369240 -0.223525 -0.229070 0.188177 0.287466 0.294604 0.288227 0.240906 0.241304 0.395173 0.374776 0.392511
chargesum: 0.00000
title: Mulliken charges with hydrogens summed into heavy atoms:
elementType: O O O O O O C C C C C C C C C C C C C C C
charge: 0.058911 -0.159702 -0.196629 0.000791 0.022096 -0.342073 0.140505 0.387904 0.251483 0.272928 -0.156507 -0.213561 0.045682 -0.377889 -0.041915 0.249632 -0.078435 -0.081013 0.017381 0.012233 0.188177
polarizability: 3.24407848e+02 -9.62032761e+00 2.17045018e+02 -1.15764114e-02 6.65140322e-03 6.80374909e+01
1716.lowfreq: -7.7873 -7.7414 -0.0003 0.0003 0.0006 5.2809 28.5458 46.1996 53.8212
frequency: 28.5372 46.1911 53.8186 104.3231 118.4338 149.8568 156.5896 194.3584 257.1873 262.0479 264.5022 290.5767 315.1685 340.1003 367.7151 376.1135 414.3236 421.5821 444.7087 454.2349 459.0392 490.2768 509.2781 543.0980 571.7583 599.2605 599.7503 634.8266 647.8559 676.7288 686.9547 716.0259 722.7440 733.0549 736.8525 784.5922 813.3551 858.0045 862.3887 900.4927 938.3621 943.9572 946.7471 999.7332 1017.6201 1018.3101 1044.0592 1046.2308 1077.2093 1103.5389 1165.5910 1174.0914 1182.8441 1193.2755 1223.8198 1268.2680 1280.6939 1306.3749 1350.4677 1371.0388 1398.4651 1405.7260 1437.3901 1441.0877 1469.8539 1470.3688 1532.9365 1546.1086 1553.0010 1586.3306 1600.5282 1612.7925 1633.5106 2755.0758 3128.7588 3137.6122 3152.4701 3163.7074 3172.7694 3493.2465 3546.0574
redmass: 8.3293 8.7765 7.7636 12.1127 5.0628 7.1225 9.9199 6.0292 6.7014 5.3746 8.5667 6.7837 6.1839 9.2996 8.1610 10.7090 7.8811 3.5228 4.7232 12.6095 1.1496 9.9125 8.4157 4.3999 6.3750 7.5575 1.5220 4.4858 5.7938 3.5694 5.0092 7.1401 5.8221 2.3563 6.5055 4.3535 2.1611 7.3127 2.0983 1.6261 1.0784 8.0177 2.2996 1.3925 1.3674 4.4435 3.9253 2.5940 3.3494 2.0462 1.7958 1.2898 1.3742 1.8596 2.2121 2.3315 2.3285 3.9491 6.9077 5.7496 8.1178 6.7255 3.1353 2.8122 3.3378 2.6819 9.0498 7.5756 4.5769 6.8792 6.5197 7.2534 4.0330 1.0733 1.0916 1.0864 1.0902 1.0946 1.1003 1.0636 1.0658
irintensity: 3.8528 0.7619 1.5119 0.5714 0.0040 2.9104 1.9658 0.0770 0.2411 9.5067 0.2124 5.4166 4.3060 0.3812 1.9236 12.2508 29.5952 7.2461 0.0618 1.1455 108.7323 2.6710 3.5432 9.5310 50.2569 46.8733 85.7339 14.8403 13.8747 64.7974 5.1367 19.1663 2.6032 73.6882 2.1084 18.5337 9.0564 7.6425 8.2412 26.1736 147.0963 9.8419 0.0813 4.7604 0.2834 146.9963 82.1011 65.2528 188.3742 292.7389 80.0754 10.9790 87.5331 106.0050 10.3386 149.9455 20.7859 257.0429 134.4262 123.7387 25.4800 148.9071 85.6483 96.5099 65.4004 7.6832 47.7870 529.7623 36.8610 67.7279 40.4628 32.5120 326.2260 585.4086 9.9295 4.0241 5.9911 1.1835 31.5462 79.7252 75.4727
temp: 298.150 k
press: 1.00000 atm
elementType: 8 8 8 8 8 8 6 6 6 6 6 6 6 6 6 6 6 6 6 6 6 1 1 1 1 1 1 1 1
symmnumber: 1
zpe: 517365.4 jmol-1
zpe.correction: 0.197054 hartree
zpe.thermalcorrener: 0.213337 hartree
zpe.thermalcorrenthalpy: 0.214281 hartree
zpe.thermalcorrgfe: 0.152634 hartree
zpe.sumelectzpe: -1026.325784 hartree
zpe.sumelectthermal: -1026.309501 hartree
zpe.sumelectthermalent: -1026.308557 hartree
zpe.sumelectthermalfe: -1026.370204 hartree
dipole: -0.2923 3.1961 0.0002
dipole: 3.2094
quadrupole: -85.8113 -126.8955 -120.4185
quadrupole: -8.6355 -0.0275 -0.0161
quadrupole: 25.2305 -15.8538 -9.3767 -8.6355 -0.0275 -0.0161
hfenergy: -1026.5228381 hartree
pointgroup: C01 [X(C15H8O6)]
dipole: 0.1221081 -1.255107 -0.0643029 debye
polarizability: 324.3255165|-8.6581367|216.5647754|-7.3749909|7.4556876|68.6000652 unknown
InChI: InChI=1S/C15H8O6/c16-9-5-8-10(14(19)11(9)15(20)21)13(18)7-4-2-1-3-6(7)12(8)17/h1-5,16,19-20H
charge 0 multiplicity 1
29 atoms
O  1.748928 2.317637 0.017237
O  -0.902033 2.661117 0.109118
O  -1.496165 -2.821058 -0.14145
O  3.475353 -2.227178 -0.25164
O  5.10166 -0.181282 -0.188404
O  4.213013 1.929523 -0.068321
C  0.189034 0.484617 -0.027209
C  0.000676 -0.928402 -0.090725
C  -2.356561 0.757086 0.055725
C  -2.541903 -0.652172 -0.008344
C  -0.988847 1.395601 0.050038
C  -1.370558 -1.556194 -0.084125
C  1.541542 0.977895 -0.040916
C  1.086941 -1.818048 -0.163835
C  2.674108 0.063299 -0.115728
C  2.410461 -1.340404 -0.177177
C  -3.491228 1.601279 0.127488
C  -3.849933 -1.202133 -0.000026
C  -4.789048 1.051576 0.135582
C  -4.970708 -0.354364 0.07167
C  4.015548 0.660527 -0.122244
H  0.86215 -2.890555 -0.209794
H  -3.32412 2.68173 0.175499
H  -3.95499 -2.290433 -0.050393
H  -5.660974 1.712166 0.191338
H  -5.980842 -0.777002 0.078356
H  2.770182 2.498807 -0.002887
H  3.142283 -3.160832 -0.287746
H  5.926833 0.379396 -0.183187
