program: Gaussian 09
title: 000160470
version: EM64L-G09RevD.01
frameworkgroup: C1[X(CH4N2O2)]
method: RPBEPBE
basis: SDD
operation: Freq
keyword: #pfreq=noraman
keyword: PBEPBE/SDD
title: #p freq=noraman PBEPBE/SDD
converged: NO NO NO NO
title: Mulliken charges:
elementType: O O N N C H H H H
charge: -0.451225 -0.277819 -0.346089 -0.513158 0.235167 0.349839 0.308108 0.308170 0.387006
chargesum: 0.00000
title: Mulliken charges with hydrogens summed into heavy atoms:
elementType: O O N N C
charge: -0.064219 -0.277819 0.003751 0.103120 0.235167
polarizability: 4.16972723e+01 -7.79698962e-01 3.40870602e+01 9.80440624e-03 9.91454602e-03 1.94527760e+01
1716.lowfreq: -18.1769 -13.7537 -0.0012 -0.0012 -0.0011 15.5352 170.9390 239.6957 252.5994
frequency: 170.8882 239.3260 252.5976 460.3770 476.0255 604.0459 626.0354 704.8810 714.3459 942.9607 1046.8093 1239.7448 1287.8564 1288.4365 1469.2962 1672.4578 1697.2881 3413.1229 3539.9255 3566.8010 3590.0941
redmass: 4.7092 1.0813 4.0957 5.0462 1.0740 1.2056 6.4974 1.4832 5.5762 9.1767 2.0026 2.8781 1.1652 1.7694 1.7612 1.2231 4.0593 1.0419 1.1017 1.0789 1.0655
irintensity: 1.3740 6.8299 15.8441 36.5763 231.2115 186.2465 5.9738 178.4277 1.3209 27.7632 262.0504 20.9466 0.3925 22.9688 143.4738 153.1232 234.3683 0.5414 3.6926 47.2995 43.8510
temp: 298.150 k
press: 1.00000 atm
elementType: 8 8 7 7 6 1 1 1 1
symmnumber: 1
zpe: 173478.4 jmol-1
zpe.correction: 0.066074 hartree
zpe.thermalcorrener: 0.071643 hartree
zpe.thermalcorrenthalpy: 0.072587 hartree
zpe.thermalcorrgfe: 0.037675 hartree
zpe.sumelectzpe: -300.030892 hartree
zpe.sumelectthermal: -300.025323 hartree
zpe.sumelectthermalent: -300.024379 hartree
zpe.sumelectthermalfe: -300.059291 hartree
dipole: -0.1516 -0.9165 -0.0001
dipole: 0.9290
quadrupole: -24.4214 -33.2775 -27.9661
quadrupole: -2.5208 0.0184 0.0042
quadrupole: 4.1336 -4.7225 0.5889 -2.5208 0.0184 0.0042
hfenergy: -300.0969662 hartree
pointgroup: C01 [X(C1H4N2O2)]
dipole: -0.0271008 0.3644911 0.0002074 debye
dipolederiv: -1.2187837 -0.3959002 -0.0002035 -0.4406231 -0.4756422 0.000323 0.0027006 0.0017021 -0.4762721 -0.6190053 -0.0075211 0.0003014 0.086454 -1.135898 0.0017673 0.0007946 -0.0031315 -0.3752561 -0.5272338 0.2910792 0.0012625 0.5810519 -0.3748264 -0.0005506 0.0004848 0.0001444 -0.5093423 -0.1961565 0.1874376 -0.0001113 0.2861575 -0.413726 0.00073 -0.0007575 0.000759 -0.0264592 1.770306 -0.0471758 -0.001339 -0.2102654 1.6594945 -0.0014797 -0.0033138 0.0007684 0.3432364 0.0999704 -0.0227112 -0.0004872 -0.0587221 0.1864435 0.0000235 -0.0011506 0.0002918 0.3907012 0.187288 -0.0404839 -0.0618601 -0.1742045 0.1955923 0.130967 -0.0304315 0.0768835 0.1198641 0.1864709 -0.0398899 0.0620872 -0.1730098 0.195204 -0.131483 0.0308703 -0.0770778 0.1203813 0.3171439 0.0751651 0.00035 0.1031614 0.1633582 -0.0002975 0.000803 -0.00034 0.4131467 unknown
polarizability: 41.7753409|0.0877737|34.0089758|-0.0108617|0.0178934|19.4527919 unknown
InChI: InChI=1S/CH4N2O2/c2-3-1(4)5/h3-4H,2H2
charge 0 multiplicity 1
9 atoms
O  1.580864 0.722497 -0.000552
O  0.315708 -1.267631 -0.000721
N  -0.692881 0.859597 0.00159
N  -2.032777 0.422738 -0.000508
C  0.375203 -0.0144 0.003537
H  -0.527011 1.866217 0.001267
H  -2.266539 -0.096518 0.855254
H  -2.264254 -0.097381 -0.856328
H  2.337387 0.082881 -0.003539
