program: Gaussian 09
title: 000160467
version: EM64L-G09RevD.01
frameworkgroup: C1[X(C21H30O5)]
method: RPBEPBE
basis: SDD
operation: Freq
keyword: #pfreq=noraman
keyword: PBEPBE/SDD
title: #p freq=noraman PBEPBE/SDD
converged: YES YES NO NO
title: Mulliken charges:
elementType: O O O O O C C C C C C C C C C C C C C C C C C C C C H H H H H H H H H H H H H H H H H H H H H H H H H H H H H H
charge: -0.439248 -0.300445 -0.200490 -0.233332 -0.344199 0.079717 -0.301968 0.040734 0.256492 -0.125120 -0.555381 0.076921 -0.499625 0.298754 -0.498141 -0.061440 -0.282979 -0.319040 0.393491 -0.697894 -0.707825 0.376517 -0.783561 -0.798501 -0.789686 -0.803515 0.273788 0.259291 0.232169 0.232506 0.241558 0.255649 0.230187 0.245497 0.209463 0.374972 0.248613 0.376908 0.210384 0.213618 0.229347 0.230001 0.206248 0.219477 0.225475 0.219685 0.227922 0.265004 0.221331 0.217736 0.216873 0.217571 0.231595 0.254202 0.220862 0.211833
chargesum: 0.00000
title: Mulliken charges with hydrogens summed into heavy atoms:
elementType: O O O O O C C C C C C C C C C C C C C C C C C C C C
charge: -0.064276 -0.300445 -0.200490 -0.233332 0.032709 0.079717 -0.028180 0.040734 0.256492 -0.125120 -0.063921 0.076921 -0.025561 0.298754 -0.012305 0.184057 -0.073516 -0.070428 0.393491 -0.044545 -0.052098 0.376517 -0.110479 -0.094430 -0.123647 -0.116618
polarizability: 3.38783739e+02 5.65712982e+00 2.32053202e+02 6.10730637e+00 -1.23896775e+01 2.03852611e+02
1716.lowfreq: -13.0425 -8.1472 0.0008 0.0008 0.0010 6.3703 8.2784 12.3800 20.4608
frequency: -5.2153 11.7192 20.2308 30.2591 36.3620 47.3835 51.4508 60.2999 69.7252 80.8273 86.0790 92.5625 100.3778 104.8791 134.7447 145.8458 174.8207 178.7399 180.0314 189.8732 204.0643 222.3885 230.9380 236.2284 263.2633 287.0441 298.5218 309.4888 326.6169 333.2164 351.9824 361.9046 373.4031 377.8787 383.0886 391.2503 396.5807 412.3851 423.8648 431.9333 451.8626 458.9841 473.0641 489.3723 506.6290 523.0736 550.2439 571.1703 606.1568 634.6583 678.1449 701.0183 744.2995 771.3357 774.4284 797.4836 827.2948 831.1952 847.7819 870.1769 880.0566 896.6688 905.0459 918.9234 933.3049 945.9314 951.2410 952.0837 956.0605 959.5320 986.7177 987.4503 995.7918 998.5142 1025.2575 1047.8109 1057.3282 1075.7020 1083.7361 1084.1522 1105.4373 1109.9397 1120.0223 1127.2729 1148.6019 1164.3126 1169.7352 1179.1600 1182.9600 1209.7597 1219.8130 1234.4595 1246.1416 1258.6954 1272.8636 1275.3321 1279.8875 1308.2902 1315.5105 1325.6131 1329.9580 1348.4221 1362.1401 1364.0741 1379.9268 1385.8725 1388.5166 1389.8294 1397.6789 1398.7270 1401.9073 1439.2133 1447.6643 1448.1350 1453.0609 1454.0777 1463.1643 1464.6038 1466.5768 1468.4897 1469.6342 1471.1234 1479.7209 1482.7269 1483.2693 1488.3808 1493.9076 1555.8041 1595.1817 1616.2989 1684.7435 1693.0261 1965.8466 2923.7510 2958.8197 2963.0882 2965.2585 2969.1202 2971.3837 2976.5774 2997.3891 3004.9899 3006.3242 3015.2619 3030.0529 3033.3781 3035.8224 3040.0003 3064.6603 3064.6656 3073.7072 3076.2138 3080.0950 3080.3164 3081.3003 3084.8146 3085.4290 3089.1134 3101.9014 3106.9761 3116.8054 3411.6872
redmass: 4.1566 3.7315 4.3290 3.0381 3.3145 3.0411 2.9070 2.2957 4.2498 1.4773 4.2757 2.3459 2.6094 1.6427 5.0625 2.3344 1.3786 1.6284 1.4533 1.5928 5.3716 2.5929 2.8634 1.5340 3.7123 3.4610 2.6464 2.9430 5.3344 2.1139 4.0810 3.0884 2.1985 2.7837 2.9404 1.7043 3.2991 3.7543 2.0955 3.0876 2.4104 3.9602 4.2744 3.4348 2.9572 3.1872 3.1896 3.7187 5.6734 6.0073 4.8828 4.1339 3.8202 2.9663 3.9509 2.9661 4.2439 3.2883 1.5685 2.1110 1.5872 2.5683 2.3313 1.3341 2.1471 2.1170 1.3901 1.5955 1.7587 2.9380 1.3793 2.0780 2.4956 1.3889 2.2328 2.4255 2.2917 1.9613 1.6954 1.6789 1.9462 1.6902 2.2237 2.6172 1.8593 1.8278 1.4794 1.1002 1.7385 2.6212 1.3684 2.4257 2.5121 1.9274 1.4472 1.3193 1.5535 2.3427 1.2885 2.0385 1.5072 1.5147 1.4346 1.4243 1.2089 3.5583 1.2844 1.2881 1.2175 1.2276 1.2440 1.3267 1.0582 1.0917 1.0849 1.0608 1.0584 1.0717 1.0549 1.0554 1.0714 1.0628 1.1568 1.1299 1.0697 1.0728 2.7006 9.1937 2.4204 9.2245 6.1969 6.3671 1.0893 1.0787 1.0374 1.0374 1.0392 1.0402 1.0356 1.0362 1.0622 1.0720 1.0654 1.0694 1.0968 1.0960 1.0965 1.0958 1.0938 1.0996 1.0993 1.0997 1.0993 1.0983 1.0983 1.0949 1.0939 1.1030 1.0941 1.0929 1.0958 1.0642
irintensity: 0.1239 0.5463 0.2162 0.1273 0.1965 0.5620 0.1137 0.6542 0.3976 1.5356 2.2676 0.5680 0.3110 0.3784 1.0214 3.4295 0.2419 0.8224 1.0066 0.1107 1.0083 0.7646 9.2361 1.9752 3.7734 1.4752 1.4148 11.1910 12.1832 7.3030 22.7442 2.9125 8.6678 4.3403 16.5895 54.8382 19.9109 8.3146 2.8483 27.2232 3.4698 39.3170 10.5312 9.2548 3.5653 14.6193 2.4209 6.0460 3.2511 2.8917 2.1163 10.6736 1.6067 3.9172 2.0954 15.0420 10.1769 45.4245 18.0376 31.1717 4.2963 17.5300 3.2154 3.3114 4.1601 7.0148 1.7257 13.0831 8.3058 76.9275 5.5191 16.1396 11.9417 11.8287 5.2095 6.9270 35.1225 26.8389 8.2792 6.5681 21.3597 96.4956 49.2406 7.8809 1.0875 50.4266 28.1793 85.3941 7.9505 21.2196 20.2706 17.1900 27.6038 13.0973 10.3502 7.5445 14.2462 22.4729 30.9497 20.7093 15.1854 73.6769 1.5608 2.6346 22.2724 112.1072 26.6141 24.8945 25.9114 12.7236 25.2588 45.0383 6.5926 24.6054 10.7167 5.5309 19.8553 39.4199 45.7495 11.9070 9.2662 14.1281 38.5993 42.2829 16.8037 7.5665 559.5576 166.0965 577.8434 98.0866 43.6744 9.1880 329.2915 10.8384 30.7387 26.4868 54.5514 60.5517 32.1083 31.8981 22.6110 1.4838 23.5944 14.8691 3.0169 51.8961 0.7181 41.7242 4.5953 3.4627 51.7869 28.0115 48.1805 1.1575 24.3736 49.7887 1.0235 22.7549 11.0727 27.7904 16.9237 39.5887
temp: 298.150 k
press: 1.00000 atm
elementType: 8 8 8 8 8 6 6 6 6 6 6 6 6 6 6 6 6 6 6 6 6 6 6 6 6 6 1 1 1 1 1 1 1 1 1 1 1 1 1 1 1 1 1 1 1 1 1 1 1 1 1 1 1 1 1 1
symmnumber: 1
zpe: 1211556.0 jmol-1
zpe.correction: 0.461457 hartree
zpe.thermalcorrener: 0.490628 hartree
zpe.thermalcorrenthalpy: 0.491572 hartree
zpe.thermalcorrgfe: 0.399377 hartree
zpe.sumelectzpe: -1192.327509 hartree
zpe.sumelectthermal: -1192.298338 hartree
zpe.sumelectthermalent: -1192.297394 hartree
zpe.sumelectthermalfe: -1192.389589 hartree
dipole: -0.3528 -0.1927 -2.8266
dipole: 2.8550
quadrupole: -142.8266 -159.8275 -164.5463
quadrupole: -1.8493 -8.0118 5.3837
quadrupole: 12.9069 -4.0940 -8.8129 -1.8493 -8.0118 5.3837
hfenergy: -1192.7889659 hartree
pointgroup: C01 [X(C21H30O5)]
dipole: -0.1785705 -0.2171451 1.0874997 debye
polarizability: 339.288595|-0.6156782|236.2065203|-1.3087516|-3.9832038|199.1944367 unknown
InChI: InChI=1S/C21H30O5/c1-12(2)7-8-15-18(23)17(16(22)11-14(5)6)20(25)21(26,19(15)24)10-9-13(3)4/h7,9,14-15,22,26H,8,10-11H2,1-6H3
charge 0 multiplicity 1
56 atoms
O  2.722133 0.428021 -1.878668
O  0.593699 2.122267 -1.954493
O  2.0517 -2.071181 -1.262191
O  -1.981408 -0.754521 0.922885
O  -1.747014 2.632302 -1.696957
C  1.733646 0.281509 -0.839672
C  0.210161 -1.525045 0.263677
C  1.365733 -1.200868 -0.660096
C  0.470922 1.078868 -1.18683
C  -0.808529 0.726149 -0.592142
C  2.3135 0.874503 0.523297
C  -0.947982 -0.48641 0.233058
C  -0.3340 -2.978837 0.088502
C  -1.930909 1.587286 -0.876703
C  -3.320884 1.438958 -0.338244
C  -3.482624 2.041985 1.104457
C  3.503944 0.104987 1.04473
C  -0.931941 -3.239804 -1.281159
C  4.821293 0.391985 0.823882
C  -3.275923 3.573187 1.113703
C  -4.877621 1.65976 1.64877
C  -2.238962 -3.498807 -1.577908
C  5.911353 -0.467903 1.441977
C  5.318918 1.555977 -0.012238
C  -2.661425 -3.784691 -3.011162
C  -3.368512 -3.547794 -0.562856
H  0.621514 -1.453266 1.297993
H  2.572761 1.920571 0.285046
H  1.507353 0.896293 1.281492
H  0.518107 -3.666647 0.250351
H  -1.067812 -3.153383 0.891477
H  -3.581373 0.369028 -0.277728
H  -4.007633 1.965494 -1.025679
H  -2.720889 1.562725 1.748497
H  3.272766 -0.776793 1.662722
H  3.055411 -0.49371 -2.079612
H  -0.205762 -3.245598 -2.106733
H  -0.675113 2.631387 -1.997408
H  -4.032873 4.076266 0.482566
H  -3.375365 3.9661 2.14243
H  -2.280738 3.862969 0.732048
H  -4.995583 0.562438 1.70574
H  -5.680167 2.063527 1.001785
H  -5.024193 2.072691 2.663886
H  6.536844 -0.933803 0.655236
H  6.592401 0.146066 2.063919
H  5.498255 -1.27308 2.073794
H  4.516646 2.057101 -0.573453
H  6.063633 1.201729 -0.751088
H  5.836199 2.299937 0.626484
H  -3.153967 -4.774699 -3.08771
H  -3.400434 -3.037513 -3.36351
H  -1.803021 -3.774257 -3.704755
H  -3.081894 -3.150502 0.423246
H  -3.731001 -4.587603 -0.433827
H  -4.233043 -2.95625 -0.923228
