program: Gaussian 09
title: 000160463
version: EM64L-G09RevD.01
frameworkgroup: C1[X(C10H12N2O)]
method: RPBEPBE
basis: SDD
operation: Freq
keyword: #p
keyword: freq=noraman
keyword: PBEPBE/SDD
title: #p freq=noraman PBEPBE/SDD
converged: YES YES NO NO
title: Mulliken charges:
elementType: O N N C C C C C C C C C C H H H H H H H H H H H H
charge: -0.444019 -0.417427 -0.572169 0.396854 0.101314 -0.529907 0.279150 -0.443166 -0.393634 -0.387743 -0.491118 -0.421139 0.327090 0.230665 0.196608 0.268130 0.303997 0.220322 0.200023 0.230119 0.251105 0.210109 0.275354 0.259772 0.349710
chargesum: 0.00000
title: Mulliken charges with hydrogens summed into heavy atoms:
elementType: O N N C C C C C C C C C C
charge: -0.094309 -0.113430 -0.037043 0.396854 0.101314 -0.102634 0.279150 -0.175036 0.026712 -0.157624 -0.240014 -0.211031 0.327090
polarizability: 1.70705740e+02 -1.40818371e+01 1.38672636e+02 7.10816524e+00 6.87207935e+00 6.75153157e+01
1716.lowfreq: -5.5776 -0.0004 -0.0002 0.0002 4.8987 14.3564 51.2446 70.5838 86.7350
frequency: 51.0590 70.5631 86.7133 147.0884 206.0718 218.8787 220.6699 303.9913 306.8218 321.6778 358.0914 393.7166 433.5631 470.0250 473.2640 507.5637 592.8914 599.7886 614.3833 622.7218 697.7989 749.1217 752.1684 778.7334 786.1459 797.3625 812.8470 844.8475 916.6954 935.7107 941.0951 1014.3833 1064.7448 1087.0263 1094.2438 1120.7796 1130.6055 1147.4703 1187.7822 1220.4955 1236.6513 1261.1846 1285.9375 1300.3621 1313.1076 1347.6273 1376.2747 1390.2206 1411.9554 1465.5243 1468.1014 1492.4919 1512.0668 1570.1526 1593.5174 1637.5868 1648.3457 2888.8039 2958.5424 3027.2492 3052.7016 3111.4990 3145.0412 3164.0823 3221.0605 3453.2688 3580.8454 3589.7775 3615.9674
redmass: 3.1540 4.8293 2.0213 4.9322 2.3965 1.3314 3.5838 2.2862 1.5344 3.9167 3.7116 4.9108 3.0051 3.9799 5.3682 1.1447 1.7689 2.1857 3.7719 3.3233 3.9858 3.1141 3.6299 1.4682 1.6116 1.5218 4.2746 1.5786 1.3336 2.9107 1.9442 2.2568 3.3092 1.6904 2.8287 1.3769 1.4420 1.4431 1.4139 1.4498 2.1609 1.5666 1.1714 2.1710 1.6272 1.8907 1.3927 4.7207 2.6527 1.1020 5.0023 1.0884 3.6848 6.6511 6.1068 1.0944 7.2013 1.0709 1.0665 1.0869 1.0972 1.0877 1.0955 1.0929 1.0983 1.0448 1.0974 1.0660 1.0808
irintensity: 1.2979 0.8206 3.4821 0.5145 25.1758 31.9598 5.8297 102.8859 47.1368 5.7200 24.6118 1.5452 4.4633 5.7010 4.2024 118.7499 170.9130 74.4342 11.2954 3.2508 4.9568 1.9649 1.0272 5.5896 80.2324 2.1778 19.1769 35.4041 0.6666 34.2692 14.2575 1.2074 1.1284 58.2472 38.8703 4.1790 164.9993 20.3133 21.6645 2.6878 29.3020 35.6509 3.2415 29.5340 11.7297 12.8148 14.3157 32.8368 45.4958 6.7366 6.6259 5.1992 15.7365 20.7384 11.8717 38.8077 74.5821 103.2299 39.8617 22.3140 39.7070 17.9859 19.3212 4.0602 1.0810 1.0068 0.1731 42.1434 56.0636
temp: 298.150 k
press: 1.00000 atm
elementType: 8 7 7 6 6 6 6 6 6 6 6 6 6 1 1 1 1 1 1 1 1 1 1 1 1
symmnumber: 1
zpe: 533531.8 jmol-1
zpe.correction: 0.203212 hartree
zpe.thermalcorrener: 0.215365 hartree
zpe.thermalcorrenthalpy: 0.216309 hartree
zpe.thermalcorrgfe: 0.164884 hartree
zpe.sumelectzpe: -572.035425 hartree
zpe.sumelectthermal: -572.023271 hartree
zpe.sumelectthermalent: -572.022327 hartree
zpe.sumelectthermalfe: -572.073753 hartree
dipole: -0.3617 -0.6075 0.4079
dipole: 0.8162
quadrupole: -81.2805 -55.4821 -80.2891
quadrupole: 1.3441 -2.3811 2.6492
quadrupole: -8.9299 16.8685 -7.9385 1.3441 -2.3811 2.6492
hfenergy: -572.2386361 hartree
pointgroup: C01 [X(C10H12N2O1)]
dipole: -0.1347536 0.2357526 -0.1714302 debye
dipolederiv: -1.5070259 -0.4769135 0.0955733 -0.3318147 -0.1904625 0.0719825 0.1275975 0.0992431 -0.4360837 -0.5684755 0.2819959 0.0257072 -0.1572497 -0.5660332 0.0004831 0.0302383 -0.0811118 -0.2862734 -0.9372738 0.0333062 0.1217581 0.0111873 -0.4916669 0.1268755 0.1151031 0.1223612 -0.2660042 0.2119292 -0.092327 -0.0333624 0.0321683 -0.0788482 0.0088153 -0.0654012 0.0364087 -0.1355261 0.0443498 0.2617463 0.0216582 -0.0176589 -0.310717 -0.0192491 -0.006877 -0.0651882 -0.0294972 0.0887641 0.055218 -0.0144164 0.0406258 0.069268 0.0690559 -0.1358739 0.0943214 0.1106486 0.1134584 0.0465897 -0.0074733 0.4704426 0.4828684 -0.0051112 0.0321244 0.0337645 0.040759 0.2087361 -0.4350469 -0.097196 -0.2901567 0.0992183 0.0608989 -0.0912687 0.0995038 -0.1782778 0.6623808 -0.0661756 -0.0622784 -0.1820235 0.3544332 -0.001366 0.036006 -0.0330676 0.163089 0.1976631 0.1517527 -0.0259476 0.0809032 0.2034121 0.0151753 -0.0400702 0.0099493 -0.1273649 -0.196437 -0.0565201 -0.0131116 -0.257765 -0.1354287 0.0451389 -0.0282796 0.0159165 -0.2124982 -0.4581322 -0.1967099 0.0085384 0.1661328 0.0330819 0.0045488 0.0458325 0.0562535 -0.2370895 1.3449418 0.4394734 -0.1360066 0.2514972 0.2192452 -0.018341 -0.1657048 -0.05183 0.0753076 -0.053394 -0.0705265 0.0585698 -0.1055158 -0.0336754 0.065275 0.0282894 0.038754 0.0528509 0.0276731 -0.0041622 -0.023014 0.075396 -0.0506099 -0.1457283 0.0206684 -0.0983519 -0.0753205 0.0318096 -0.0724155 0.0232198 -0.0724544 0.0179434 -0.0079926 0.0212321 -0.0074615 0.1985252 0.1353832 0.0097054 0.0292758 0.0006918 0.2205526 -0.0138374 0.0320464 -0.0084326 0.338359 0.023075 0.0061892 -0.0304659 -0.0243069 -0.0180221 -0.1279386 0.0049856 -0.0973307 -0.0762457 -0.2354629 -0.071236 0.1017245 -0.1310339 -0.0632521 0.0786837 0.080192 0.0342629 0.0018542 0.0034625 0.1104595 0.0327662 0.0990086 -0.0159905 -0.0237541 0.0370535 -0.0285318 0.1356526 0.0157137 0.0586863 0.0309533 0.0868816 0.0066076 -0.0312776 0.0356365 -0.0276305 0.1863505 0.0081606 -0.107063 0.0115571 -0.0985201 -0.1010898 -0.0164291 0.015305 -0.0135451 0.173589 0.2218088 0.1004902 -0.0296947 0.2395371 0.1632389 0.071152 -0.0936175 0.0476114 0.05769 0.2088731 -0.0092608 -0.0976607 0.0628109 0.1078563 -0.1682 -0.0360785 -0.1278711 0.1518426 0.4080183 0.1027443 0.0093258 0.0512164 0.0780707 -0.0388599 0.0008605 -0.0479974 0.373663 unknown
polarizability: 171.5756191|12.5510323|138.2253806|-8.2199158|3.5282832|67.0926914 unknown
InChI: InChI=1S/C10H12N2O/c11-4-3-7-6-12-10-5-8(13)1-2-9(7)10/h1-2,5-6,12-13H,3-4,11H2
charge 0 multiplicity 1
25 atoms
O  4.122501 0.826591 -0.322178
N  0.277879 -2.257957 -0.05704
N  -4.466434 1.429038 -0.332627
C  -1.305898 -0.648168 0.339436
C  -0.004064 -0.008394 0.202907
C  -2.630069 0.031124 0.587096
C  0.968488 -1.043922 -0.044305
C  -1.089929 -2.015052 0.176162
C  -3.162959 0.80899 -0.646088
C  0.443567 1.335706 0.274812
C  2.343217 -0.778526 -0.220782
C  1.811219 1.620545 0.103512
C  2.744827 0.567989 -0.143251
H  -3.402124 -0.704599 0.876527
H  -2.53726 0.741822 1.435871
H  -1.806292 -2.834064 0.21289
H  0.697581 -3.173498 -0.198394
H  -3.309931 0.094615 -1.477098
H  -2.381174 1.532685 -0.980817
H  -0.263429 2.150753 0.465101
H  3.087778 -1.557215 -0.408926
H  2.168097 2.657564 0.159151
H  -4.977569 1.781084 -1.147572
H  -4.425786 2.123247 0.42103
H  4.302765 1.795742 -0.245612
