program: Gaussian 09
title: 000160445
version: EM64L-G09RevD.01
frameworkgroup: C1[X(C16H10S)]
method: RPBEPBE
basis: SDD
operation: Freq
keyword: #pfreq=noraman
keyword: PBEPBE/SDD
title: #p freq=noraman PBEPBE/SDD
converged: NO NO NO NO
title: Mulliken charges:
elementType: S C C C C C C C C C C C C C C C C H H H H H H H H H H
charge: 0.247817 0.235786 0.446797 0.200654 0.422266 0.671203 -0.402847 -0.486400 -0.660895 -0.491811 -0.475656 -0.363757 -0.431597 -0.283629 -0.260574 -0.248771 -0.515044 0.236575 0.251575 0.238225 0.234836 0.221215 0.239406 0.255037 0.228056 0.229597 0.261936
chargesum: 0.00000
title: Mulliken charges with hydrogens summed into heavy atoms:
elementType: S C C C C C C C C C C C C C C C C
charge: 0.247817 0.235786 0.446797 0.200654 0.422266 0.671203 -0.166272 -0.486400 -0.409320 -0.253586 -0.240820 -0.142543 -0.192191 -0.028593 -0.032517 -0.019174 -0.253107
polarizability: 3.49286302e+02 -5.77831733e+00 2.02368541e+02 -5.87413458e-04 9.67477421e-04 6.89033045e+01
1716.lowfreq: -0.0026 -0.0018 0.0007 7.2304 12.2588 18.5129 73.0117 74.4078 158.8391
frequency: 73.0024 74.3818 158.8351 159.7511 189.8924 282.3007 301.1542 303.0957 325.8419 408.6904 426.5418 430.8522 477.3881 492.7458 530.5368 539.2335 558.8154 563.5579 608.8959 651.6953 665.0330 707.5027 719.5637 722.3848 758.3388 768.0769 773.2126 802.9310 803.8331 829.8261 865.7082 879.4455 889.6313 894.0485 924.0951 955.6297 957.8708 983.9690 992.7496 1018.1072 1044.6739 1087.4202 1105.2407 1155.7465 1177.9441 1179.1619 1230.4800 1237.2652 1253.3508 1268.1227 1298.1700 1308.2349 1372.6912 1399.4442 1400.1858 1426.0203 1449.9060 1457.0761 1476.9845 1517.4521 1531.8619 1569.9268 1610.3489 1625.1149 1628.6846 3116.1136 3120.2557 3127.1566 3131.4505 3141.7841 3146.4097 3157.7609 3164.8270 3171.9203 3232.3074
redmass: 4.8902 5.1125 6.6414 4.4980 4.8081 4.0676 5.0094 6.6030 7.4309 3.0553 3.0251 5.2568 3.7735 6.1659 6.3991 3.4283 3.0418 7.7775 7.6271 7.4449 2.5614 5.6940 1.9520 6.8098 1.3052 5.9880 1.9789 1.9479 5.0306 1.4528 4.5374 1.3770 1.6788 1.6697 1.7458 3.3845 1.4026 1.3781 1.3830 5.7215 2.2931 1.1488 2.1041 1.4232 1.2701 1.1233 1.9284 1.8989 1.7273 1.3452 1.9785 3.4152 3.1140 4.6249 3.5894 2.7717 3.2462 3.7795 3.9360 4.1882 5.6750 7.5838 6.1579 7.1295 6.8059 1.0860 1.0866 1.0919 1.0879 1.0984 1.0942 1.0920 1.0984 1.0918 1.0999
irintensity: 0.8002 0.7788 0.6512 1.1098 0.5700 2.1090 0.4121 1.2112 0.3472 0.9757 10.7108 4.2981 10.5702 0.2756 0.4758 1.3592 3.1477 2.4376 7.3390 2.9595 12.1172 0.6371 45.6000 7.8340 51.6199 10.3890 33.4102 0.3648 5.6051 27.1524 1.3386 12.5684 15.7542 4.9177 49.0213 4.4994 9.6007 0.5130 0.0004 9.8083 10.3500 12.0255 9.4405 1.7504 1.0018 2.6521 0.4994 14.3877 1.6678 2.8978 0.6770 3.9963 1.1187 4.5192 1.9437 16.8630 17.2012 20.6414 0.6260 7.4779 5.0711 1.0634 2.7390 1.1606 0.2391 0.4476 5.2438 9.2332 3.1430 32.3030 28.8287 8.7460 35.1907 7.0600 1.2727
temp: 298.150 k
press: 1.00000 atm
elementType: 16 6 6 6 6 6 6 6 6 6 6 6 6 6 6 6 6 1 1 1 1 1 1 1 1 1 1
symmnumber: 1
zpe: 537067.4 jmol-1
zpe.correction: 0.204558 hartree
zpe.thermalcorrener: 0.216552 hartree
zpe.thermalcorrenthalpy: 0.217496 hartree
zpe.thermalcorrgfe: 0.166271 hartree
zpe.sumelectzpe: -1012.665077 hartree
zpe.sumelectthermal: -1012.653083 hartree
zpe.sumelectthermalent: -1012.652139 hartree
zpe.sumelectthermalfe: -1012.703364 hartree
dipole: 0.0188 0.8607 0.0000
dipole: 0.8609
quadrupole: -87.5743 -92.4495 -113.7970
quadrupole: -4.0505 0.0001 0.0001
quadrupole: 10.3660 5.4908 -15.8567 -4.0505 0.0001 0.0001
hfenergy: -1012.8696352 hartree
pointgroup: C01 [X(C16H10S1)]
dipole: -0.0171747 0.3382852 -0.0000012 debye
dipolederiv: -0.3374543 0.0764286 -0.0000006 -0.2085886 -0.2625159 -0.0000036 -0.0000091 -0.0000104 0.0916016 0.1186475 0.0362037 0. 0.0811319 0.0267648 0.0000012 -0.0000068 -0.0000011 -0.0220975 0.0691384 0.1282174 0.0000026 0.0801983 -0.1283186 -0.0000026 -0.0000008 -0.0000004 0.0545829 0.1749304 -0.0926669 -0.0000009 -0.0735308 -0.0366055 0. 0.0000002 0.0000022 0.0034635 -0.0598888 -0.1386459 -0.0000011 -0.1850366 0.0208043 -0.0000005 -0.0000003 -0.0000032 0.0543464 0.1501692 0.1160359 0.0000019 -0.1592228 -0.1791414 -0.0000002 -0.0000042 -0.0000025 0.080591 -0.2307601 -0.1240145 -0.0000022 -0.1408279 0.0003532 0.0000004 0.0000007 0.0000027 -0.1001392 0.3841505 0.3511711 0.0000087 0.5076896 0.1397876 0.0000042 0.0000078 0.0000034 -0.1484335 0.0085443 -0.0905924 -0.0000005 -0.1041452 0.1225677 0.0000034 -0.000003 0.0000051 -0.1931529 0.0266825 -0.0364607 -0.0000009 0.1681886 0.1255291 0.0000003 0.0000031 -0.0000012 -0.1763382 -0.0825152 0.0934482 -0.000001 -0.0387503 0.1047344 0.0000021 0.0000028 0.0000038 -0.1824002 -0.1058995 0.0887083 -0.0000038 0.0478508 0.0204991 -0.0000001 -0.000004 -0.0000002 -0.1425051 0.0631902 0.1099464 0.0000017 0.1776144 0.0384301 0.0000054 0.0000042 0.0000076 -0.1739266 -0.0072563 -0.1618187 -0.0000015 -0.128638 -0.1876656 -0.0000054 0.0000044 0.0000007 -0.1735549 -0.1048724 -0.0460919 -0.0000002 -0.0269896 0.0966591 -0.0000016 0.0000074 -0.0000072 -0.1648963 0.0651628 -0.0122373 -0.0000038 0.0436789 -0.0485542 0.0000016 -0.0000042 0.0000027 -0.162322 -0.2312691 -0.2724275 -0.0000036 -0.1546478 0.4257654 0.0000055 0.000015 0.0000097 -0.2880467 0.0921161 0.0446687 -0.0000002 0.0422353 -0.0411827 -0.000001 0.0000012 -0.0000019 0.1491325 0.0473087 0.0244355 -0.0000004 0.0519833 -0.082657 -0.0000023 0.0000003 -0.0000039 0.1599223 0.0479768 0.1075211 0.000001 0.0161206 -0.0909097 -0.0000018 -0.0000002 0. 0.1536113 -0.0311747 -0.1350042 -0.0000002 -0.0614969 -0.0287553 -0.0000011 -0.0000021 -0.0000018 0.1542984 0.0307446 -0.124725 0.000002 -0.073469 -0.0235878 0.0000006 0.0000026 0.000001 0.1416947 0.0001705 -0.0635129 -0.0000008 -0.1422233 -0.0490343 -0.0000031 -0.0000026 -0.0000048 0.154886 0.0471904 0.0181662 0. 0.1225711 -0.0294843 0.0000013 -0.0000023 0.0000006 0.1928212 0.0415551 0.063261 0.0000007 0.1040729 -0.1035171 -0.0000005 -0.000002 0.0000038 0.1602329 -0.1529529 0.0422064 0.0000033 0.0454439 0.0860032 -0.0000012 0.0000016 -0.0000016 0.1624361 -0.0236349 -0.0022207 0. 0.0087872 0.0840313 -0.0000008 -0.0000096 -0.0000029 0.2141922 unknown
polarizability: 349.3497129|4.9059876|202.3051295|-0.000656|0.0009223|68.9033045 unknown
InChI: InChI=1S/C16H10S/c1-2-4-14-11(3-1)5-6-12-9-13-7-8-17-16(13)10-15(12)14/h1-10H
charge 0 multiplicity 1
27 atoms
S  -3.624355 -2.006365 0.000041
C  0.09892 -0.113826 0.000074
C  -0.357721 1.265266 0.000081
C  1.542023 -0.389231 0.000066
C  2.470013 0.71607 0.000067
C  -2.703975 0.52885 0.00006
C  -0.874061 -1.155481 0.000066
C  -2.233336 -0.833772 0.00006
C  -1.74793 1.561285 0.000071
C  0.616881 2.33784 0.000085
C  1.970245 2.075749 0.000072
C  2.07806 -1.713294 0.000052
C  3.875431 0.460913 0.000051
C  -4.155108 0.614209 0.000049
C  3.461681 -1.942922 0.000029
C  4.37238 -0.848362 0.000029
C  -4.778624 -0.612154 0.000065
H  -0.563409 -2.20382 0.000059
H  -2.071315 2.60917 0.00008
H  0.248598 3.370884 0.000091
H  2.698289 2.895732 0.000074
H  1.405985 -2.57724 0.000061
H  4.563831 1.314831 0.000066
H  -4.702404 1.560245 0.000041
H  3.842824 -2.970106 0.000029
H  5.452283 -1.031939 0.000017
H  -5.846705 -0.825533 0.000062
