program: Gaussian 09
title: 000170811
version: EM64L-G09RevD.01
frameworkgroup: C1[X(C19H19NO2)]
method: RPBEPBE
basis: SDD
operation: Freq
keyword: #p
keyword: freq=noraman
keyword: PBEPBE/SDD
title: #p freq=noraman PBEPBE/SDD
converged: YES YES NO NO
title: Mulliken charges:
elementType: O O N C C C C C C C C C C C C C C C C C C C H H H H H H H H H H H H H H H H H H H
charge: -0.313107 -0.234047 -0.021181 -0.377710 -0.334254 -0.571457 -0.359015 0.518416 -0.400875 -0.406786 -0.692642 0.218029 -0.342285 -0.329214 0.143073 0.399873 -0.392417 -0.299374 -0.342450 -0.361351 0.395792 -0.255908 0.209537 0.209550 0.189420 0.189580 0.211433 0.211412 0.197869 0.197764 0.241319 0.239567 0.210313 0.218546 0.210473 0.267069 0.262629 0.260422 0.312629 0.260354 0.259005
chargesum: 0.00000
title: Mulliken charges with hydrogens summed into heavy atoms:
elementType: O O N C C C C C C C C C C C C C C C C C C C
charge: -0.313107 -0.234047 -0.021181 0.041377 0.044746 -0.148612 0.036618 0.518416 -0.159555 -0.167219 -0.053310 0.218029 -0.075215 -0.066585 0.143073 0.399873 -0.131996 0.013255 -0.082096 -0.102347 0.395792 -0.255908
polarizability: 4.17044918e+02 -1.62155135e+01 1.90936375e+02 2.12419894e+01 2.25847947e+01 1.22725864e+02
1716.lowfreq: -11.9774 -3.2441 -0.0012 -0.0008 0.0013 3.0541 11.0234 15.7971 29.1827
frequency: 5.9602 15.6637 29.1782 35.4649 42.7722 59.5098 65.6344 89.6693 106.2183 122.2786 131.1991 133.7505 158.8756 208.7494 230.4064 241.7421 267.9461 291.8768 326.1627 336.9459 358.7119 404.8095 407.4369 412.5907 438.8049 468.5909 486.6944 530.1903 544.4589 560.0184 619.8226 632.0062 643.3403 676.9333 701.4311 725.4755 731.2443 753.2577 754.6245 774.5805 803.1976 830.1217 836.6052 840.9621 859.0830 863.6603 864.9910 897.8364 953.6266 970.5654 983.6469 990.2329 995.3344 996.6375 998.9698 1007.3074 1024.2563 1043.8619 1071.5479 1077.2710 1109.0731 1116.6005 1129.3927 1156.0760 1184.5780 1195.7001 1196.1306 1211.3330 1219.9682 1238.9571 1241.1891 1252.8490 1281.7841 1289.4690 1298.5757 1302.5620 1311.3058 1333.3530 1351.7970 1359.3233 1386.7267 1390.2402 1414.5370 1417.2922 1463.6815 1464.9513 1473.7192 1477.5449 1482.6553 1484.7236 1488.5280 1498.7152 1565.3666 1571.4519 1611.7750 1618.9620 1632.9167 2177.3052 2954.6987 2967.5250 2972.6236 2973.8268 2982.8571 2993.9614 3015.2608 3030.3256 3051.4626 3070.4607 3073.6351 3128.1952 3131.2853 3157.6278 3160.8786 3161.2596 3179.0078 3179.9374 3215.5826
redmass: 3.8583 5.0449 3.9850 1.8181 5.8714 5.6034 7.0044 2.2379 6.0295 2.1478 4.7379 6.7302 5.2906 5.7289 1.1185 4.7284 6.8470 6.1614 5.3642 3.3205 3.4686 2.8617 2.9803 3.6973 5.3936 5.3354 7.1021 3.3132 7.3672 3.2178 6.1808 6.9863 6.6989 4.3275 7.0221 1.0679 3.8385 1.6134 2.0261 6.9140 4.9816 6.1870 1.2282 1.3119 1.3291 1.5191 1.5942 1.8934 1.2310 1.3627 1.5320 1.3372 1.4957 6.1766 2.6142 2.9114 2.8808 3.2571 1.3465 2.3993 2.2822 1.3346 1.2839 2.1270 1.1582 2.1370 1.5963 2.2968 2.2857 1.5557 2.9469 1.2923 1.0892 1.1106 1.3957 1.2713 1.2722 1.4181 1.6128 5.5993 4.8121 1.2137 3.4588 3.8957 1.0710 1.0825 1.0755 1.0435 1.0838 2.4505 1.0935 2.6355 7.3843 7.1704 6.2874 6.3927 11.4283 12.6294 1.0589 1.0591 1.0556 1.0395 1.0591 1.0983 1.1012 1.1036 1.1047 1.1008 1.0993 1.0894 1.0901 1.0890 1.0922 1.0954 1.0977 1.0945 1.0947
irintensity: 0.0657 0.1126 0.5873 0.1660 0.0829 0.2162 2.7684 0.1381 0.2343 0.5370 1.9445 2.6150 1.5021 1.7343 0.0114 4.5658 0.2821 0.4391 1.4758 1.2990 7.3695 0.0065 0.1155 0.4727 1.4571 1.0184 2.9315 10.9087 0.3339 21.3293 2.3566 5.8382 5.0052 31.8249 1.7382 9.4996 0.2501 3.3527 4.3839 4.8297 4.1337 14.9247 0.6994 11.5585 4.3622 12.6648 110.7214 1.1226 4.0002 0.0153 2.2630 1.1282 11.4088 370.9996 1.4373 57.9379 183.0120 0.7565 8.1365 1.0952 49.2894 13.4694 14.7005 526.3098 127.2777 4.5821 0.0424 253.5691 1.8793 68.0311 235.2300 0.4551 0.2670 0.9187 3.8542 8.3354 0.1648 2.0126 1.0608 5.7278 1.7428 10.2079 14.6104 23.1735 0.8608 0.0204 4.2626 12.6936 0.0288 159.5786 24.1570 14.7584 4.8166 14.4373 134.2475 85.0729 188.7376 60.9628 12.0472 12.5374 45.3021 32.4821 85.7400 1.0376 1.9227 11.8109 57.4026 91.2428 50.7621 12.7766 17.7054 4.0827 4.2208 6.7994 2.2778 3.2348 6.2315
temp: 298.150 k
press: 1.00000 atm
elementType: 8 8 7 6 6 6 6 6 6 6 6 6 6 6 6 6 6 6 6 6 6 6 1 1 1 1 1 1 1 1 1 1 1 1 1 1 1 1 1 1 1
symmnumber: 1
zpe: 862724.4 jmol-1
zpe.correction: 0.328594 hartree
zpe.thermalcorrener: 0.349917 hartree
zpe.thermalcorrenthalpy: 0.350861 hartree
zpe.thermalcorrgfe: 0.272966 hartree
zpe.sumelectzpe: -939.049546 hartree
zpe.sumelectthermal: -939.028223 hartree
zpe.sumelectthermalent: -939.027279 hartree
zpe.sumelectthermalfe: -939.105174 hartree
dipole: -7.7929 -0.8717 -1.1210
dipole: 7.9212
quadrupole: -174.1833 -124.1577 -132.3538
quadrupole: 4.1256 -2.9912 4.4990
quadrupole: -30.6183 19.4072 11.2112 4.1256 -2.9912 4.4990
hfenergy: -939.3781401 hartree
pointgroup: C01 [X(C19H19N1O2)]
dipole: 3.064602 -0.2638582 0.5008691 debye
polarizability: 417.5843601|17.9149672|176.2499049|15.5620841|-36.0007798|136.8728922 unknown
InChI: InChI=1S/C19H19NO2/c1-2-3-4-5-15-6-10-17(11-7-15)19(21)22-18-12-8-16(14-20)9-13-18/h6-13H,2-5H2,1H3
charge 0 multiplicity 1
41 atoms
O  -1.698169 0.018062 0.256631
O  -1.333833 2.010129 -0.955168
N  -8.46961 -1.037244 -0.188365
C  5.52868 -0.363482 -0.128481
C  7.034091 -0.547503 0.16406
C  4.78205 0.37838 1.018483
C  7.785669 -1.28107 -0.970563
C  3.30364 0.558261 0.723257
C  2.845609 1.65886 -0.051315
C  2.347808 -0.391406 1.173562
C  9.289022 -1.467345 -0.671289
C  0.537257 0.84823 0.0875
C  1.483544 1.806225 -0.367335
C  0.981055 -0.255071 0.863748
C  -0.885531 1.059237 -0.276132
C  -3.101871 -0.087674 0.092053
C  -3.652817 -1.215341 0.748595
C  -3.925606 0.803856 -0.640855
C  -5.032759 -1.462755 0.678749
C  -5.309464 0.546515 -0.704933
C  -5.878072 -0.580156 -0.051928
C  -7.293051 -0.82886 -0.126935
H  5.397872 0.202817 -1.072623
H  5.055407 -1.352876 -0.290258
H  7.501942 0.445437 0.330997
H  7.159391 -1.113098 1.11118
H  5.263039 1.364731 1.169434
H  4.916317 -0.194399 1.956564
H  7.662775 -0.713691 -1.915485
H  7.314885 -2.270943 -1.139078
H  3.56773 2.406058 -0.40146
H  2.683462 -1.243187 1.777013
H  9.439539 -2.060782 0.25027
H  9.804024 -1.990672 -1.497575
H  9.788552 -0.490845 -0.526319
H  1.12731 2.654811 -0.960702
H  0.25243 -0.988993 1.217278
H  -2.98664 -1.880819 1.304615
H  -3.495457 1.670013 -1.142725
H  -5.46293 -2.332388 1.184287
H  -5.95689 1.226379 -1.267351
