program: Gaussian 09
title: 000160441
version: EM64L-G09RevD.01
frameworkgroup: C1[X(C16H10S)]
method: RPBEPBE
basis: SDD
operation: Freq
keyword: #pfreq=noraman
keyword: PBEPBE/SDD
title: #p freq=noraman PBEPBE/SDD
converged: NO YES NO NO
title: Mulliken charges:
elementType: S C C C C C C C C C C C C C C C C H H H H H H H H H H
charge: 0.260874 0.143749 0.214385 0.466726 0.440905 0.408028 -0.489575 -0.478568 -0.466372 -0.486713 -0.304069 -0.356960 -0.227489 -0.441568 -0.563627 -0.270668 -0.249430 0.238166 0.244079 0.237685 0.247310 0.227363 0.243026 0.240189 0.264111 0.227982 0.230461
chargesum: 0.00000
title: Mulliken charges with hydrogens summed into heavy atoms:
elementType: S C C C C C C C C C C C C C C C C
charge: 0.260874 0.143749 0.214385 0.466726 0.440905 0.408028 -0.489575 -0.240402 -0.222293 -0.249028 -0.056760 -0.129597 0.015536 -0.201379 -0.299517 -0.042686 -0.018969
polarizability: 3.00213106e+02 -5.54446607e+00 2.22768553e+02 -5.10896274e+00 2.39533638e-01 7.22677177e+01
1716.lowfreq: -9.2325 -3.9124 -0.0024 -0.0021 -0.0014 6.0487 70.5600 78.5968 131.9404
frequency: 70.5573 78.5943 131.9390 185.4443 204.6420 267.7443 281.2048 313.4109 337.6804 408.9826 423.1635 439.0996 488.9741 508.1717 515.1077 542.8834 558.4671 579.1816 618.9982 636.7446 643.2276 701.5408 708.7476 728.1906 754.8850 760.6173 795.3103 801.4985 812.6751 816.3000 857.8769 869.9559 880.9229 890.5646 952.9856 960.2944 982.5236 990.1593 991.8451 1011.8910 1047.8030 1104.0561 1133.9032 1160.7917 1164.5826 1176.9646 1205.5039 1232.4365 1239.8829 1242.3213 1293.3186 1328.5944 1378.4965 1386.9062 1406.9840 1415.5064 1421.0119 1446.9634 1488.8264 1517.4695 1520.6751 1562.0002 1587.6630 1616.5732 1628.3675 3120.4691 3122.1160 3133.1372 3135.5838 3146.3517 3158.9905 3161.5736 3195.8524 3209.5211 3238.1583
redmass: 4.4101 5.6285 5.4658 4.4555 5.1957 4.4128 4.9696 5.4855 9.1378 5.7956 3.2309 3.9717 3.7846 4.7622 6.2783 5.3823 3.9633 3.6218 8.1983 6.4665 2.7942 3.1368 2.4041 4.4306 1.5401 1.8972 5.0156 1.5655 4.6513 2.2452 1.9865 4.3939 1.6234 1.3760 1.3337 1.3960 1.3900 1.4162 3.5747 5.2347 2.2080 1.1921 1.7936 1.4250 1.2776 1.1407 1.8673 2.4844 1.7881 1.6333 1.5742 2.7258 3.9239 4.9297 3.1134 2.9347 3.5090 2.5119 4.1490 4.3599 5.0359 7.3712 6.7136 6.1769 6.8867 1.0865 1.0864 1.0881 1.0903 1.0986 1.0984 1.0974 1.0929 1.0880 1.1015
irintensity: 0.0754 0.2548 0.1355 4.6178 1.7497 1.7996 0.4338 4.1851 0.2607 3.5998 3.7119 3.2099 4.1443 1.8491 0.2800 2.0381 4.7701 6.0983 0.4436 3.6038 3.2767 30.2098 50.2231 21.0535 48.5718 6.7887 26.3772 3.6219 0.3806 4.5798 69.8319 10.8680 9.9859 15.1480 0.4283 5.2115 0.3565 0.3001 2.7748 7.3316 9.0768 3.3130 15.5656 10.8704 2.7835 0.0625 3.0196 0.2322 12.9191 0.4181 4.4815 12.3735 8.3379 2.2864 4.6794 0.1951 4.4320 17.0322 13.1289 2.3546 0.4609 0.8524 2.6427 0.6812 0.9470 1.6248 3.0786 4.3116 12.6515 34.0908 42.0693 13.5228 4.4217 7.2513 1.2305
temp: 298.150 k
press: 1.00000 atm
elementType: 16 6 6 6 6 6 6 6 6 6 6 6 6 6 6 6 6 1 1 1 1 1 1 1 1 1 1
symmnumber: 1
zpe: 537316.8 jmol-1
zpe.correction: 0.204653 hartree
zpe.thermalcorrener: 0.216630 hartree
zpe.thermalcorrenthalpy: 0.217574 hartree
zpe.thermalcorrgfe: 0.166431 hartree
zpe.sumelectzpe: -1012.659810 hartree
zpe.sumelectthermal: -1012.647833 hartree
zpe.sumelectthermalent: -1012.646889 hartree
zpe.sumelectthermalfe: -1012.698031 hartree
dipole: 0.7277 -0.1106 -0.1074
dipole: 0.7438
quadrupole: -95.2933 -88.0916 -112.9778
quadrupole: 0.1693 -0.4369 0.2358
quadrupole: 3.4943 10.6959 -14.1902 0.1693 -0.4369 0.2358
hfenergy: -1012.8644629 hartree
pointgroup: C01 [X(C16H10S1)]
dipole: 0.2883503 -0.0256587 -0.042869 debye
polarizability: 300.579619|-0.7072986|222.3801043|-5.582393|0.1034718|72.2896538 unknown
InChI: InChI=1S/C16H10S/c1-2-4-13-11(3-1)5-6-12-7-8-15-14(16(12)13)9-10-17-15/h1-10H
charge 0 multiplicity 1
27 atoms
S  -4.101956 -0.990303 0.019883
C  -0.22045 0.261609 0.013867
C  1.138965 -0.291526 0.038751
C  -1.440726 -0.523565 -0.036607
C  -0.368107 1.69834 0.03557
C  2.267551 0.599483 -0.137817
C  -2.695517 0.146242 0.107933
C  0.790348 2.552205 -0.091092
C  -1.658608 2.31198 0.161028
C  2.057548 2.024088 -0.224871
C  -2.823862 1.550437 0.235072
C  1.437584 -1.669762 0.294489
C  -1.642932 -1.946301 -0.286392
C  3.597721 0.076103 -0.169476
C  -2.961359 -2.345179 -0.286844
C  2.751313 -2.157864 0.285668
C  3.845084 -1.28699 0.019816
H  0.63241 3.636906 -0.099828
H  -1.714072 3.405699 0.198864
H  2.928593 2.675824 -0.35807
H  -3.804887 2.021145 0.348415
H  0.637329 -2.356148 0.572179
H  -0.850139 -2.651084 -0.532115
H  4.429448 0.773845 -0.324439
H  -3.364779 -3.34027 -0.465893
H  2.936567 -3.216141 0.500346
H  4.868333 -1.676672 -0.002239
