program: Gaussian 09
title: 000160440
version: EM64L-G09RevD.01
frameworkgroup: C1[X(C6H10O2)]
method: RPBEPBE
basis: SDD
operation: Freq
keyword: #pfreq=noraman
keyword: PBEPBE/SDD
title: #p freq=noraman PBEPBE/SDD
converged: NO NO NO NO
title: Mulliken charges:
elementType: O O C C C C C C H H H H H H H H H H
charge: -0.293189 -0.231074 0.446753 -0.453500 -0.500389 -0.405374 -0.394293 -0.302789 0.216730 0.216116 0.235772 0.200931 0.240004 0.179621 0.201699 0.238046 0.176067 0.228870
chargesum: 0.00000
title: Mulliken charges with hydrogens summed into heavy atoms:
elementType: O O C C C C C C
charge: -0.293189 -0.231074 0.446753 -0.020654 -0.063686 0.014250 0.045451 0.102148
polarizability: 8.05947081e+01 2.89979458e+00 6.23445740e+01 1.78147610e+00 5.30814477e-01 5.64571770e+01
1716.lowfreq: -29.1466 -0.0012 -0.0011 -0.0010 2.5856 13.3327 111.2670 186.6230 288.0910
frequency: 111.1852 186.6187 288.0879 289.9544 374.6743 375.2669 442.6085 458.7112 560.7914 653.0537 772.1490 818.9102 846.6949 861.0499 867.8387 920.3932 950.4963 988.8318 1025.8160 1054.7598 1066.2859 1096.5946 1136.3300 1159.6430 1193.9779 1236.5217 1266.2628 1286.9960 1312.8018 1326.6508 1342.9666 1360.4992 1398.0284 1433.5279 1447.0993 1454.1720 1461.3653 1486.3268 2907.7968 2916.5057 2973.1002 2998.2538 3046.6777 3053.0915 3066.2852 3078.4005 3084.5897 3144.8313
redmass: 3.4141 3.1233 2.5416 2.5717 2.1003 2.3812 2.6784 3.8127 2.7789 4.7994 2.7383 3.2705 1.8100 5.3416 1.8628 1.6137 2.0353 1.8963 2.5342 1.3707 2.7007 1.7145 1.4113 1.2311 1.4903 1.3377 1.4739 1.4807 1.4884 1.5174 1.4176 1.2894 2.1687 1.0845 1.0931 1.0918 1.0906 1.2410 1.0691 1.0696 1.0639 1.0613 1.0535 1.0976 1.1005 1.0949 1.0939 1.1180
irintensity: 1.4233 4.9703 0.9648 2.1227 4.9676 2.6926 3.4483 7.6818 4.7370 16.5217 4.7469 24.2510 10.2908 17.8179 9.4064 8.8346 7.4018 3.3683 47.9620 1.3985 35.8281 0.9757 7.4570 6.6427 6.6250 3.1279 6.1586 1.9502 6.7479 8.4935 1.2422 1.0294 2.4189 8.5883 11.5818 10.7616 6.7493 4.5575 44.5227 100.8598 32.2438 34.8362 36.6087 19.5858 41.0471 36.5365 14.3779 28.2230
temp: 298.150 k
press: 1.00000 atm
elementType: 8 8 6 6 6 6 6 6 1 1 1 1 1 1 1 1 1 1
symmnumber: 1
zpe: 398257.6 jmol-1
zpe.correction: 0.151688 hartree
zpe.thermalcorrener: 0.158969 hartree
zpe.thermalcorrenthalpy: 0.159913 hartree
zpe.thermalcorrgfe: 0.120421 hartree
zpe.sumelectzpe: -384.380372 hartree
zpe.sumelectthermal: -384.373091 hartree
zpe.sumelectthermalent: -384.372147 hartree
zpe.sumelectthermalfe: -384.411639 hartree
dipole: 0.0492 1.5424 -3.3377
dipole: 3.6772
quadrupole: -45.6370 -48.3403 -50.8896
quadrupole: 4.0834 3.6180 1.4547
quadrupole: 2.6519 -0.0513 -2.6006 4.0834 3.6180 1.4547
hfenergy: -384.5320601 hartree
pointgroup: C01 [X(C6H10O2)]
dipole: -0.0099734 -0.652366 -1.2912584 debye
dipolederiv: -0.3686193 -0.0043933 -0.0791099 -0.0064488 -0.3993908 0.0097654 -0.1617599 -0.0001552 -0.6224457 -0.7910626 -0.1452747 0.0450674 -0.1140341 -0.6101392 0.0774455 0.0487898 0.079203 -0.4015396 0.2042738 0.0268556 0.0534949 0.0912139 0.2962026 -0.0023257 0.2373589 0.033038 0.2658563 0.087563 -0.0197403 -0.0299012 0.0078433 0.2735283 0.0010999 -0.1155016 -0.0015478 0.1661684 -0.0230427 -0.0140693 0.0102485 -0.0079966 -0.0418331 -0.0110252 -0.0108197 0.0321267 0.1179231 0.5768227 0.0580604 -0.1006008 -0.0905768 0.1643961 -0.0330448 -0.182697 -0.1425201 0.4037326 0.0306155 0.0827983 0.0150451 0.0086223 -0.0509533 0.0225107 -0.0355226 0.0241146 0.073096 0.4379823 0.110595 0.0661983 0.2345008 0.5242645 -0.020544 0.1573948 -0.00211 0.3668291 0.00179 0.0626448 0.0648361 0.1133747 -0.0754456 -0.0617577 0.0734238 -0.0252782 0.0472635 0.0133409 -0.06548 0.0641632 -0.1126627 -0.0832414 0.0620706 0.0748014 0.0269121 0.0529352 -0.0296616 0.1181048 -0.0194172 0.0889076 -0.066612 0.0250026 -0.0201537 0.0508334 0.0778445 0.021141 -0.0366675 -0.0440561 -0.045726 0.0712507 0.0018827 -0.0201638 -0.0402664 -0.1679114 -0.0151322 -0.1036235 -0.0028496 -0.0748581 -0.0457495 -0.0171328 -0.0140019 -0.0570844 0.0753584 -0.049707 0.0237762 -0.0501307 0.0515074 0.0676427 -0.0116131 0.0340146 0.0773223 -0.2248338 -0.047194 -0.1169745 -0.0127027 -0.1403546 -0.1136601 -0.0244528 -0.02978 -0.0521643 0.0810867 0.0558526 0.03772 -0.0398865 0.0313662 0.0791338 -0.0123555 -0.0013318 0.0306512 -0.1253651 0.0312533 -0.0209043 -0.015569 -0.0532174 -0.0271234 0.008389 -0.1533137 -0.0173747 -0.224682 -0.136216 0.0065721 0.0751705 0.0185389 0.0377296 -0.0139147 0.1192625 -0.0157003 0.038684 unknown
polarizability: 80.487209|3.1462739|62.4029265|-1.9010713|-0.7704873|56.5063237 unknown
InChI: InChI=1S/C6H10O2/c1-2-6(5-8-6)4-7-3-1/h1-5H2
charge 0 multiplicity 1
18 atoms
O  1.6767 -0.00007 1.021573
O  -1.299868 1.245292 0.261808
C  0.796082 -0.014003 -0.216535
C  2.283584 0.021877 -0.35959
C  0.012633 -1.304625 -0.441687
C  -0.015485 1.255668 -0.453106
C  -1.344445 -1.242992 0.303452
C  -2.094515 0.049084 -0.073625
H  2.817767 -0.894558 -0.64643
H  2.787825 0.961319 -0.62591
H  0.61284 -2.16713 -0.100357
H  -0.164964 -1.427046 -1.530612
H  0.522465 2.140842 -0.07659
H  -0.195909 1.366265 -1.548887
H  -1.966461 -2.123485 0.05095
H  -1.166693 -1.251398 1.394514
H  -2.32946 0.05108 -1.164119
H  -3.031897 0.16298 0.495252
