program: Gaussian 09
title: 000170789
version: EM64L-G09RevD.01
frameworkgroup: C1[X(C11H18O3Si)]
method: RPBEPBE
basis: SDD
operation: Freq
keyword: #p
keyword: freq=noraman
keyword: PBEPBE/SDD
title: #p freq=noraman PBEPBE/SDD
converged: YES YES NO NO
title: Mulliken charges:
elementType: Si O O O C C C C C C C C C C C H H H H H H H H H H H H H H H H H H
charge: 1.549262 -0.592640 -0.574609 -0.582581 -0.927897 -0.502920 0.507957 -0.414023 -0.412211 -0.226765 -0.227047 -0.475859 -0.491563 -0.486652 -0.243071 0.267406 0.274283 0.228557 0.219545 0.229575 0.227469 0.223527 0.223360 0.222356 0.213408 0.228312 0.238709 0.217793 0.202420 0.205368 0.214504 0.236734 0.227294
chargesum: 0.00000
title: Mulliken charges with hydrogens summed into heavy atoms:
elementType: Si O O O C C C C C C C C C C C
charge: 1.549262 -0.592640 -0.574609 -0.582581 -0.386208 -0.054819 0.507957 -0.184448 -0.184742 -0.003238 -0.003687 0.188216 0.167359 0.169954 -0.015777
polarizability: 1.84651808e+02 -2.17023944e-01 1.51579898e+02 -9.24431207e+00 -4.48841910e-02 1.01267643e+02
1716.lowfreq: -9.3948 -0.0013 -0.0002 0.0013 3.1983 9.3433 21.1441 26.8671 32.5412
frequency: 19.4221 24.1212 32.5103 51.3433 53.8873 56.3425 75.7612 76.1521 90.6314 92.9890 105.9052 133.3818 140.9627 162.4182 217.8240 226.6203 281.7219 309.9094 326.7023 347.6698 397.1705 402.0068 497.3835 529.7317 594.5376 617.4010 687.3619 704.8383 709.9861 751.0411 772.1231 778.8397 826.5044 851.7617 919.8644 934.8548 974.5428 989.7055 993.2322 1004.9222 1026.4633 1048.3576 1049.3070 1067.1969 1069.3820 1119.5429 1122.1784 1122.5873 1126.5865 1145.2513 1146.6533 1151.9016 1171.7176 1186.0230 1217.1218 1230.5208 1272.2989 1326.9398 1328.6031 1382.8808 1431.8616 1440.5985 1444.2747 1447.3525 1450.1230 1468.3383 1470.0473 1473.2133 1474.7398 1475.9956 1477.9230 1481.3986 1485.0619 1593.0544 1613.9549 2941.4450 2944.3627 2957.1563 2989.2407 3000.5454 3024.2365 3025.6008 3037.6419 3044.1212 3062.2420 3088.1126 3088.8414 3090.4538 3111.6542 3113.0355 3130.4486 3142.0872 3161.4975
redmass: 3.3968 3.0285 4.0675 2.9713 3.5944 2.8950 2.4500 1.1686 1.1393 1.9876 1.4636 4.0561 3.2900 2.7615 4.8422 4.0949 4.5871 4.7227 3.0984 3.8678 7.7859 2.8137 3.3189 6.4119 4.8826 6.3687 3.0803 1.8310 7.3096 2.2172 1.5842 4.6306 3.1703 1.2491 1.5015 1.6201 1.3887 6.2974 1.3502 4.3012 2.1813 5.5930 6.4394 4.9212 1.5053 1.2505 1.2441 1.2317 1.1837 1.3931 1.4363 1.4732 1.0520 1.1139 2.6956 1.2901 1.2125 1.2952 1.3347 7.5241 1.0755 2.1655 1.1234 1.1209 1.1144 1.0519 1.0534 1.0542 1.0505 1.0539 1.0531 1.9311 1.2143 6.0318 6.2074 1.0336 1.0332 1.0312 1.0602 1.0591 1.1018 1.1025 1.1004 1.1037 1.1015 1.0994 1.0997 1.1016 1.0875 1.0867 1.0904 1.0957 1.1014
irintensity: 0.8429 1.6999 0.9212 2.2134 2.0420 2.7856 3.1180 0.3453 0.7724 0.6904 1.6545 16.5349 11.6131 14.1690 5.7256 5.6158 6.4974 5.5061 6.4897 8.5417 65.4829 0.0146 12.9083 7.9693 27.6887 0.0238 19.7538 60.0060 68.9760 124.6920 45.3576 58.5650 18.4027 0.2145 4.3422 23.4195 0.1481 0.0803 1.8876 29.0775 3.6411 373.2429 292.5170 32.1246 5.1833 0.2761 1.9225 4.2693 18.7556 29.6577 63.9036 10.1015 0.1650 0.1886 1.5744 46.0381 1.2287 1.3520 1.9185 0.1311 11.1684 7.0004 0.8212 0.0802 3.9420 10.7667 9.4578 7.3875 5.6397 1.6198 6.9957 19.8721 7.5842 1.2847 10.1869 114.2784 40.7964 84.9922 10.1500 23.2729 40.6546 96.2446 2.1068 50.7222 20.8812 31.1505 49.4168 27.2508 9.7643 10.9781 9.0647 45.9199 25.3984
temp: 298.150 k
press: 1.00000 atm
elementType: 14 8 8 8 6 6 6 6 6 6 6 6 6 6 6 1 1 1 1 1 1 1 1 1 1 1 1 1 1 1 1 1 1
symmnumber: 1
zpe: 707329.5 jmol-1
zpe.correction: 0.269408 hartree
zpe.thermalcorrener: 0.288625 hartree
zpe.thermalcorrenthalpy: 0.289569 hartree
zpe.thermalcorrgfe: 0.217403 hartree
zpe.sumelectzpe: -943.912729 hartree
zpe.sumelectthermal: -943.893511 hartree
zpe.sumelectthermalent: -943.892567 hartree
zpe.sumelectthermalfe: -943.964733 hartree
dipole: -0.1620 0.1067 1.5483
dipole: 1.5604
quadrupole: -91.1141 -81.5224 -107.2577
quadrupole: -1.0582 4.2992 0.4011
quadrupole: 2.1840 11.7757 -13.9596 -1.0582 4.2992 0.4011
hfenergy: -944.1821363 hartree
pointgroup: C01 [X(C11H18O3Si1)]
dipole: -0.0609511 0.0434695 0.609309 debye
polarizability: 184.5673441|-1.0551184|151.612243|-9.4742815|0.2031176|101.3197615 unknown
InChI: InChI=1S/C11H18O3Si/c1-12-15(13-2,14-3)10-9-11-7-5-4-6-8-11/h4-8H,9-10H2,1-3H3
charge 0 multiplicity 1
33 atoms
Si 2.221584 -0.02907 -0.009562
O  3.10263 -0.173503 1.464847
O  2.736188 1.327175 -0.934832
O  2.568848 -1.32492 -1.086439
C  0.394826 0.040387 0.480566
C  -0.573585 0.033539 -0.742371
C  -2.032306 0.042332 -0.306271
C  -2.729045 -1.172869 -0.079196
C  -2.716215 1.26427 -0.076589
C  -4.068082 -1.169381 0.372393
C  -4.055265 1.274021 0.374914
C  4.557263 -0.137978 1.606573
C  2.420965 2.720563 -0.645551
C  2.621832 -2.735936 -0.725767
C  -4.736217 0.055608 0.603328
H  0.216676 0.939307 1.101475
H  0.179703 -0.825985 1.135226
H  -0.364063 -0.858847 -1.362461
H  -0.3621 0.91285 -1.381209
H  -2.219654 -2.127483 -0.263379
H  -2.197363 2.214283 -0.258873
H  -4.591016 -2.118247 0.538779
H  -4.568248 2.227929 0.543477
H  5.001307 0.702757 1.038863
H  5.013822 -1.083892 1.255278
H  4.772369 -0.009771 2.680164
H  2.719514 3.304257 -1.531611
H  2.983202 3.088919 0.235282
H  1.336641 2.876627 -0.464914
H  1.626208 -3.120159 -0.422379
H  3.338263 -2.924794 0.098489
H  2.954717 -3.280479 -1.624367
H  -5.775399 0.060692 0.951016
