program: Gaussian 09
title: 000160433
version: EM64L-G09RevD.01
frameworkgroup: C1[X(C14H18N2O4)]
method: RPBEPBE
basis: SDD
operation: Freq
keyword: #p
keyword: freq=noraman
keyword: PBEPBE/SDD
title: #p freq=noraman PBEPBE/SDD
converged: YES YES NO NO
title: Mulliken charges:
elementType: O O O O N N C C C C C C C C C C C C C C H H H H H H H H H H H H H H H H H H
charge: -0.285898 -0.473158 -0.432699 -0.435067 -0.213015 -0.063653 -0.091830 -0.190742 -0.145197 -0.062265 -0.339390 0.327050 -0.243034 -0.038617 -0.569997 0.388336 -0.525194 0.361160 -0.821730 -0.817189 0.235601 0.252135 0.250439 0.251567 0.186921 0.238634 0.286946 0.383381 0.372723 0.234038 0.256253 0.354134 0.229439 0.227953 0.227239 0.225467 0.222833 0.236423
chargesum: 0.00000
title: Mulliken charges with hydrogens summed into heavy atoms:
elementType: O O O O N N C C C C C C C C C C C C C C
charge: -0.285898 -0.089777 -0.059976 -0.080933 -0.213015 -0.063653 0.143771 0.061394 0.105243 0.189302 0.086165 0.327050 0.043912 -0.038617 -0.335959 0.388336 -0.268941 0.361160 -0.137099 -0.132466
polarizability: 2.58608481e+02 7.64724237e+00 1.55698848e+02 7.42856092e+00 2.13879952e+01 1.26825226e+02
1716.lowfreq: -6.6913 -4.2438 -0.0004 -0.0002 0.0003 4.1879 14.2198 35.3960 48.7099
frequency: 13.7825 35.3903 48.7059 72.6444 91.9885 118.7911 122.8930 133.4269 142.1031 165.9994 186.2608 227.2004 237.9369 250.8443 273.0465 289.4555 301.5781 315.5701 336.0563 346.6982 377.8241 410.5028 432.5074 443.3024 447.1679 490.5312 497.1588 534.0833 545.7082 571.7562 623.8282 656.4438 658.4844 715.9868 730.1205 766.2092 780.5903 796.4837 803.5708 824.8529 836.7212 850.0402 861.5432 896.4479 903.5370 943.6808 973.1699 996.5718 1002.6878 1015.8038 1026.9148 1030.8065 1034.4628 1052.7264 1055.2630 1075.8629 1111.3247 1118.8344 1158.8522 1170.1033 1183.9265 1188.5183 1207.0110 1213.9367 1251.0095 1254.0331 1271.4987 1281.2456 1287.9718 1307.4083 1330.3759 1333.4032 1341.0430 1350.0275 1375.9269 1381.6125 1386.9364 1389.9659 1394.4237 1406.7776 1435.6345 1442.5711 1455.0630 1461.1712 1465.7697 1476.1809 1483.6146 1487.7045 1579.4663 1640.8788 2957.5634 2969.1905 2970.2929 3008.4519 3010.4191 3025.6767 3040.5416 3043.3411 3049.7226 3080.4249 3086.2417 3086.5370 3125.2975 3153.1175 3247.8754 3499.1997 3552.3171 3584.1690
redmass: 5.5261 5.4735 4.5621 5.4475 5.1158 1.3790 5.3355 2.5904 2.3749 2.9076 1.1555 5.8059 4.4266 1.2337 3.6907 4.1791 2.5614 4.1438 3.9331 4.6093 3.1370 3.4244 2.6646 1.5339 3.6159 1.2271 4.5128 3.8103 5.1345 3.4128 4.2832 3.8906 3.8254 5.7459 5.3163 3.6578 4.8097 5.8868 3.8353 1.3684 3.3668 1.4812 3.5216 1.4426 2.7714 4.7711 3.9378 1.6306 1.5610 2.5283 2.6575 1.4455 2.7994 1.6330 3.0828 4.4871 2.2380 2.8766 1.3880 2.9882 2.5086 1.3499 1.3165 1.7784 1.3076 1.3227 1.3229 1.5644 2.4173 1.3823 1.5977 2.2800 1.4728 1.4411 1.4543 1.2296 3.7401 1.3644 1.2401 1.2811 2.3412 3.6044 1.0845 1.0477 2.6323 1.0542 1.3211 1.5057 8.1813 7.6590 1.0688 1.0374 1.0382 1.0845 1.0852 1.0871 1.0970 1.0969 1.0874 1.0984 1.0978 1.0950 1.0918 1.0925 1.0982 1.0647 1.0659 1.0665
irintensity: 0.8617 0.3412 0.1883 0.5010 7.4991 0.5222 0.3940 1.1250 6.5855 3.8552 0.3919 0.7465 8.3261 158.4789 60.4429 13.6183 0.8179 9.0158 3.3082 1.5082 18.7759 30.1209 9.1322 119.5762 43.8359 122.9261 7.6033 6.2368 12.3696 0.8203 4.0805 0.6715 11.2568 15.9443 5.3267 1.5056 9.6464 39.0844 1.4763 7.7654 21.7324 27.6294 24.5532 13.8356 64.1471 118.3153 164.4121 11.1717 9.1077 43.0132 11.2526 17.4432 26.4618 0.1183 130.3475 17.7353 13.3513 6.3623 11.6577 5.4985 22.6216 30.8862 70.3731 97.5353 27.8205 1.2791 9.8416 15.1226 1.2609 24.9172 8.1976 62.4008 5.9279 1.6269 22.3849 49.7719 12.2530 44.0986 10.1004 17.9507 20.9424 88.0868 5.2624 0.1055 31.0769 30.3414 16.7468 21.7168 9.2187 6.0824 47.7365 64.5114 23.3483 20.3402 5.9529 24.9197 43.8765 0.0245 42.4305 30.3943 12.2648 18.0577 17.6680 7.0801 0.7254 28.1776 9.8834 18.8077
temp: 298.150 k
press: 1.00000 atm
elementType: 8 8 8 8 7 7 6 6 6 6 6 6 6 6 6 6 6 6 6 6 1 1 1 1 1 1 1 1 1 1 1 1 1 1 1 1 1 1
symmnumber: 1
zpe: 798437.5 jmol-1
zpe.correction: 0.304109 hartree
zpe.thermalcorrener: 0.323512 hartree
zpe.thermalcorrenthalpy: 0.324457 hartree
zpe.thermalcorrgfe: 0.255362 hartree
zpe.sumelectzpe: -953.162934 hartree
zpe.sumelectthermal: -953.143530 hartree
zpe.sumelectthermalent: -953.142586 hartree
zpe.sumelectthermalfe: -953.211681 hartree
dipole: -3.3204 -4.6609 -0.4038
dipole: 5.7369
quadrupole: -126.7783 -124.7518 -118.8674
quadrupole: 1.1076 4.7727 4.2186
quadrupole: -3.3125 -1.2859 4.5984 1.1076 4.7727 4.2186
hfenergy: -953.4670426 hartree
pointgroup: C01 [X(C14H18N2O4)]
dipole: -1.2681916 -1.8670564 -0.015008 debye
polarizability: 258.1546714|10.166596|159.3783264|7.1236946|18.9339222|123.5995572 unknown
InChI: InChI=1S/C14H18N2O4/c1-7-3-9-10(4-8(7)2)16(6-15-9)14-13(19)12(18)11(5-17)20-14/h3-4,6,11-14,17-19H,5H2,1-2H3
charge 0 multiplicity 1
38 atoms
O  2.219876 0.25805 -0.9964
O  1.93538 -0.441792 2.124274
O  4.363744 -1.36858 1.555173
O  4.626451 1.492417 -2.043692
N  0.081267 0.285999 0.1134
N  -1.055982 2.112685 0.91171
C  1.206443 -0.549322 -0.290681
C  1.946061 -1.24132 0.899033
C  3.433176 -1.22777 0.455965
C  3.538921 0.123718 -0.295572
C  4.624068 0.195683 -1.36432
C  -1.291302 -0.007897 -0.053739
C  0.148658 1.573446 0.689875
C  -1.981105 1.137247 0.457844
C  -1.980868 -1.122975 -0.570698
C  -3.394219 -1.084949 -0.586682
C  -3.392601 1.164717 0.445923
C  -4.103802 0.062404 -0.075101
C  -4.166592 -2.266344 -1.14742
C  -5.623012 0.087567 -0.099425
H  0.818299 -1.308501 -0.994855
H  1.550714 -2.257205 1.085939
H  3.636655 -2.06747 -0.23218
H  3.6458 0.957838 0.425931
H  4.485317 -0.637678 -2.086943
H  5.616326 0.104339 -0.892096
H  1.101136 2.06043 0.881788
H  1.012411 -0.310498 2.455782
H  3.98517 -0.858428 2.321741
H  -1.459447 -2.004753 -0.960676
H  -3.921833 2.039729 0.836605
H  3.719485 1.640026 -2.417151
H  -4.80305 -1.967435 -2.002392
H  -3.487271 -3.062337 -1.497281
H  -4.84247 -2.708634 -0.390251
H  -6.016435 0.011427 -1.131541
H  -6.057623 -0.75688 0.469555
H  -6.010647 1.022546 0.338559
