program: Gaussian 09
title: 000160418
version: EM64L-G09RevD.01
frameworkgroup: C1[X(C12H11Cl3N2O4)]
method: RPBEPBE
basis: SDD
operation: Freq
keyword: #p
keyword: freq=noraman
keyword: PBEPBE/SDD
title: #p freq=noraman PBEPBE/SDD
converged: YES YES NO NO
title: Mulliken charges:
elementType: Cl Cl Cl O O O O N N C C C C C C C C C C C C H H H H H H H H H H H
charge: 0.040303 -0.006048 0.034578 -0.288045 -0.425808 -0.489612 -0.428547 -0.186846 -0.035289 -0.053142 -0.165415 -0.190408 -0.076489 -0.319724 0.393298 -0.207728 0.090428 -0.365807 -0.199410 -0.083835 -0.107088 0.240516 0.275477 0.245620 0.258975 0.185839 0.220628 0.267439 0.374851 0.371583 0.266557 0.363149
chargesum: 0.00000
title: Mulliken charges with hydrogens summed into heavy atoms:
elementType: Cl Cl Cl O O O O N N C C C C C C C C C C C C
charge: 0.040303 -0.006048 0.034578 -0.288045 -0.050957 -0.118028 -0.065398 -0.186846 -0.035289 0.187374 0.110062 0.055212 0.182486 0.086743 0.393298 0.059710 0.090428 -0.099250 -0.199410 -0.083835 -0.107088
polarizability: 2.69065702e+02 -7.43189665e+00 1.94448402e+02 3.07261279e+00 -1.44160123e+01 1.03872944e+02
1716.lowfreq: -8.5128 -0.0025 -0.0019 -0.0015 0.9930 4.7694 7.0106 24.1070 40.9890
frequency: -5.0856 24.0609 40.9816 53.4855 75.6144 91.1763 104.1197 122.4332 142.6647 152.3441 181.1304 200.6622 221.2758 242.2663 256.0423 259.0442 282.3411 311.8854 317.0666 327.8769 336.5735 360.4053 374.8536 412.8584 462.2586 475.9037 511.8203 519.7473 528.6000 556.1940 600.4845 608.9323 630.8486 647.4447 684.1872 712.8116 732.3124 775.4921 805.8336 819.7610 825.8772 842.7288 866.0578 880.1414 916.1135 937.2137 959.6683 970.9813 1006.0797 1039.8372 1053.1109 1056.5063 1080.3625 1095.8159 1142.6363 1151.9208 1161.8794 1178.2954 1210.5932 1222.2584 1236.8793 1248.7610 1260.0481 1268.6538 1292.8954 1311.8527 1332.8566 1334.7286 1357.3104 1361.9740 1372.0210 1383.5178 1392.8693 1417.9702 1424.1716 1451.5800 1458.8578 1559.6083 1615.6227 2937.0170 3015.9967 3020.3587 3027.2635 3060.0224 3066.0077 3176.0574 3234.0640 3468.0596 3536.0287 3612.0334
redmass: 8.2683 7.8279 7.8020 6.1503 21.9795 6.4578 3.3612 7.3602 10.7622 7.3457 11.0914 31.7903 8.3434 1.3000 6.1740 5.2730 3.7763 4.6353 7.7200 7.2060 11.8007 6.1809 12.8989 5.0508 1.1783 8.9940 1.9619 3.3098 1.7069 5.3964 5.9196 4.6717 4.0736 10.4475 4.7538 9.9722 6.6280 4.5400 3.8073 4.9695 1.4327 1.7864 3.2605 6.8159 6.5438 5.6581 3.4093 2.8182 3.3841 2.3991 3.0839 4.7109 3.3594 2.7506 1.9741 1.8343 2.1955 1.1904 1.8919 1.4359 1.4742 1.2534 2.1769 1.4636 1.5025 1.5595 1.5216 2.3160 2.3214 2.0682 1.3179 1.2727 2.0536 2.7578 5.2260 4.8967 1.0962 10.7467 9.2670 1.0689 1.0869 1.0850 1.0861 1.0871 1.0943 1.0934 1.0980 1.0644 1.0656 1.0672
irintensity: 0.0505 0.0351 0.4958 3.8966 0.0401 3.5632 6.2430 0.1651 0.3703 0.1246 0.5786 0.0013 0.5719 123.8236 7.4086 1.3566 23.0185 9.7136 3.2779 1.5570 3.7062 3.6474 0.3700 1.2893 151.7292 3.9403 83.8875 25.5024 43.1849 11.0792 15.3888 22.2984 8.9101 0.4374 25.7764 51.2195 40.3887 1.8619 24.0771 39.2039 28.8989 5.7176 59.1715 32.6139 68.0940 134.1305 72.8361 51.0417 88.6426 41.7686 23.9180 83.8340 34.6214 2.5711 51.2699 1.7570 49.2154 23.6468 125.1751 66.7887 3.8846 16.5420 8.0429 8.9997 5.4450 40.2447 2.3349 18.9720 52.0953 5.8306 55.7513 41.1865 28.4692 67.8876 72.3332 93.4764 9.6529 32.1429 36.6480 58.9448 33.4967 10.0556 23.1657 18.6239 47.7084 0.4419 0.3443 50.5737 13.7533 27.9165
temp: 298.150 k
press: 1.00000 atm
elementType: 17 17 17 8 8 8 8 7 7 6 6 6 6 6 6 6 6 6 6 6 6 1 1 1 1 1 1 1 1 1 1 1
symmnumber: 1
zpe: 578974.4 jmol-1
zpe.correction: 0.220520 hartree
zpe.thermalcorrener: 0.239660 hartree
zpe.thermalcorrenthalpy: 0.240604 hartree
zpe.thermalcorrgfe: 0.171630 hartree
zpe.sumelectzpe: -2252.856894 hartree
zpe.sumelectthermal: -2252.837753 hartree
zpe.sumelectthermalent: -2252.836809 hartree
zpe.sumelectthermalfe: -2252.905784 hartree
dipole: 8.4062 3.8481 0.5395
dipole: 9.2608
quadrupole: -124.9556 -147.3065 -153.1660
quadrupole: 13.2870 9.8874 -4.2676
quadrupole: 16.8538 -5.4971 -11.3567 13.2870 9.8874 -4.2676
hfenergy: -2253.0774134 hartree
pointgroup: C01 [X(C12H11Cl3N2O4)]
dipole: 3.2773831 1.5897654 0.0801671 debye
polarizability: 268.1337787|-3.0350974|184.1555565|14.3570703|-32.0465449|115.0977131 unknown
InChI: InChI=1S/C12H11Cl3N2O4/c13-4-1-5-9(8(15)7(4)14)16-3-17(5)12-11(20)10(19)6(2-18)21-12/h1,3,6,10-12,18-20H,2H2
charge 0 multiplicity 1
32 atoms
Cl -4.233049 -2.459354 0.738728
Cl -3.79499 2.595232 -1.657638
Cl -5.635306 0.121041 -0.675775
O  2.365521 -0.329747 -0.894302
O  1.783445 2.028374 1.88846
O  3.653896 2.465441 0.088095
O  4.398418 -2.240685 -1.249241
N  0.258243 -0.310228 0.217715
N  -1.025967 -2.07963 0.915477
C  1.445965 0.474578 -0.056869
C  2.287802 0.868452 1.197237
C  3.699351 1.078632 0.586365
C  3.78119 0.040604 -0.552525
C  4.502244 -1.262674 -0.172571
C  -1.069874 0.026572 -0.105185
C  0.211419 -1.579728 0.820933
C  -1.853002 -1.088266 0.345049
C  -1.638346 1.160196 -0.712409
C  -3.255568 -1.062561 0.172548
C  -3.033901 1.15041 -0.872606
C  -3.849263 0.062039 -0.441068
H  1.143634 1.391613 -0.596811
H  2.292131 0.038761 1.924215
H  4.505461 0.957897 1.335203
H  4.233713 0.46951 -1.465823
H  4.087954 -1.664897 0.779309
H  5.583572 -1.082564 -0.040465
H  1.11053 -2.100498 1.142594
H  2.15486 2.8249 1.416612
H  4.551005 2.777692 -0.181231
H  -1.055617 2.020244 -1.049951
H  3.440029 -2.315957 -1.49867
