program: Gaussian 09
title: 000160400
version: EM64L-G09RevD.01
frameworkgroup: C1[X(C14H18O3)]
method: RPBEPBE
basis: SDD
operation: Freq
keyword: #pfreq=noraman
keyword: PBEPBE/SDD
title: #p freq=noraman PBEPBE/SDD
converged: NO YES NO NO
title: Mulliken charges:
elementType: O O O C C C C C C C C C C C C C C H H H H H H H H H H H H H H H H H H
charge: -0.179829 -0.176648 -0.208435 -0.155605 0.366447 -0.264353 -0.464368 -0.514691 -0.316259 -0.549541 0.156306 -0.772543 -0.768837 0.464320 -0.390162 -0.110881 -0.227809 0.270833 0.249153 0.218405 0.214834 0.242693 0.248185 0.288475 0.232556 0.252068 0.223477 0.216035 0.228098 0.227205 0.212932 0.218698 0.219296 0.179584 0.170362
chargesum: 0.00000
title: Mulliken charges with hydrogens summed into heavy atoms:
elementType: O O O C C C C C C C C C C C C C C
charge: -0.179829 -0.176648 -0.208435 0.115228 0.366447 -0.015200 -0.031128 -0.023813 -0.027785 -0.064916 0.156306 -0.104933 -0.110003 0.464320 -0.170867 0.068703 -0.057448
polarizability: 1.83297467e+02 -5.89615828e+00 1.34118434e+02 8.66341986e+00 -2.87373035e+00 1.38026493e+02
1716.lowfreq: -14.7508 -10.1650 -4.8302 -0.0008 -0.0004 -0.0002 32.0463 42.3484 70.7527
frequency: 31.8691 42.0117 70.7432 82.4182 119.9673 137.7442 147.1078 181.1853 184.6977 194.6854 217.9204 243.6897 260.9825 288.5655 310.6477 317.6019 330.6474 375.8317 414.2111 437.0628 447.6592 477.2925 505.2030 514.7076 558.5283 587.6452 668.3083 694.4006 700.9267 746.5397 783.5350 813.5173 835.5018 864.1997 895.1605 909.2099 934.1700 941.9358 953.1204 963.8424 978.1828 986.1298 1001.3939 1005.9581 1015.8383 1036.8285 1077.9986 1113.9084 1129.3139 1137.8016 1161.6979 1176.5333 1179.3563 1193.6414 1221.5581 1230.2686 1246.5770 1263.9091 1277.0421 1298.3522 1308.3421 1313.9704 1338.9231 1347.0849 1348.1792 1359.7632 1376.9010 1381.2677 1398.9739 1409.4295 1441.4145 1447.5748 1464.8483 1471.1146 1479.8405 1483.1792 1494.6132 1596.4747 1628.8613 1639.7844 1671.4099 2874.4370 2881.9080 2947.4379 2957.4100 2972.7698 2976.5343 2978.1954 2981.5694 2984.3520 3007.3505 3020.5687 3034.6196 3063.7865 3069.9980 3071.9506 3073.7510 3076.4412 3094.1112
redmass: 6.2768 5.7138 6.8958 4.3461 3.2314 3.5662 5.1364 1.3726 2.7286 2.1007 1.5986 1.8884 5.4456 3.0325 2.1275 2.2555 2.8528 2.8034 2.8009 2.7556 3.9397 3.6892 3.4577 3.0154 4.4862 4.9559 3.4447 4.4338 4.2264 2.1469 2.6447 3.0753 1.5540 2.4431 2.2284 2.2024 1.6066 1.8362 1.6326 2.0911 1.7562 2.0943 2.1110 1.7133 2.1068 2.0934 1.7887 2.3589 2.9008 1.9154 1.4012 1.6212 2.4156 1.6524 1.8264 1.5280 1.4832 1.7784 1.5444 1.4092 1.4832 1.2860 1.5751 1.4790 1.6534 1.5582 1.2242 1.1955 1.2057 1.6851 1.0888 1.0828 1.0563 1.0606 1.0636 1.0639 1.0572 7.9498 9.3067 8.0663 7.2339 1.0856 1.0860 1.0670 1.0794 1.0361 1.0482 1.0564 1.0695 1.0704 1.0826 1.0916 1.1007 1.0998 1.0981 1.0987 1.0967 1.0981 1.0902
irintensity: 10.5186 1.4289 3.5828 1.5559 1.7523 8.1946 10.5291 1.0075 3.5062 2.0517 0.7136 2.1302 6.4995 3.1534 6.7987 0.3876 3.0960 1.6192 0.2923 1.5112 1.9691 5.5330 0.3472 7.2899 2.2372 2.0075 5.0508 1.9441 21.3009 1.0644 6.6334 2.6315 25.2565 27.8642 5.9986 6.5025 2.7412 3.0399 2.8674 1.1589 6.0374 11.0792 10.5627 0.5361 21.6986 4.1297 7.2243 6.7885 63.3133 4.6067 3.8941 10.5040 18.3778 24.4990 4.0679 21.6177 29.0031 5.1491 11.0600 2.6295 23.3703 2.0308 7.7886 4.2585 4.9305 4.4093 5.7883 21.3645 19.8938 16.3823 13.6463 14.6070 10.0245 4.1740 10.4297 14.8940 19.6806 194.9036 212.6393 54.5530 68.1153 120.7712 109.2759 9.0869 13.8288 22.8859 15.3313 24.5488 34.1716 12.9974 7.8521 17.5960 33.6170 7.7055 32.4072 64.8528 13.4565 47.6233 23.2891
temp: 298.150 k
press: 1.00000 atm
elementType: 8 8 8 6 6 6 6 6 6 6 6 6 6 6 6 6 6 1 1 1 1 1 1 1 1 1 1 1 1 1 1 1 1 1 1
symmnumber: 1
zpe: 755958.7 jmol-1
zpe.correction: 0.287929 hartree
zpe.thermalcorrener: 0.304754 hartree
zpe.thermalcorrenthalpy: 0.305698 hartree
zpe.thermalcorrgfe: 0.243588 hartree
zpe.sumelectzpe: -768.641106 hartree
zpe.sumelectthermal: -768.624282 hartree
zpe.sumelectthermalent: -768.623338 hartree
zpe.sumelectthermalfe: -768.685447 hartree
dipole: 6.8820 -0.5133 1.4205
dipole: 7.0458
quadrupole: -114.5029 -116.5769 -90.6772
quadrupole: -0.1210 -6.1554 -4.2719
quadrupole: -7.2506 -9.3246 16.5752 -0.1210 -6.1554 -4.2719
hfenergy: -768.9290354 hartree
pointgroup: C01 [X(C14H18O3)]
dipole: 2.6950133 0.327272 -0.5602556 debye
polarizability: 182.7473041|7.9868603|135.0587775|-8.3805264|-3.459252|137.6363119 unknown
InChI: InChI=1S/C14H18O3/c1-14(2)6-5-12(17)13-10(8-16)9(7-15)3-4-11(13)14/h3,7-8,10-11,13H,4-6H2,1-2H3
charge 0 multiplicity 1
35 atoms
O  -0.067709 -2.678858 -0.016048
O  -1.969217 2.033699 1.448898
O  -4.164051 -0.48066 -0.000534
C  0.866868 0.770898 -0.155995
C  2.433505 0.70334 -0.037032
C  0.182446 -0.341254 0.712038
C  2.935172 -0.719905 -0.42913
C  0.356919 0.699832 -1.621644
C  -1.371642 -0.243334 0.685427
C  2.217042 -1.874258 0.323955
C  0.697316 -1.732457 0.300997
C  3.093527 1.745397 -0.980761
C  2.873241 1.048507 1.414148
C  -1.909245 0.034974 -0.700602
C  -1.12507 0.455142 -1.735356
C  -1.786755 0.821693 1.706974
C  -3.358361 -0.149597 -0.914365
H  0.535636 1.745633 0.256903
H  0.52773 -0.197845 1.758865
H  4.023827 -0.787057 -0.238873
H  2.803369 -0.871347 -1.518335
H  0.882702 -0.099616 -2.188473
H  0.603154 1.641476 -2.148422
H  -1.784952 -1.210177 1.034309
H  2.536405 -1.872898 1.386698
H  2.488455 -2.856474 -0.099318
H  2.725408 2.766378 -0.766391
H  4.190517 1.746981 -0.840661
H  2.898249 1.526699 -2.045503
H  2.488015 2.041276 1.712707
H  2.524229 0.316041 2.163935
H  3.976494 1.080787 1.479876
H  -1.587188 0.617945 -2.721062
H  -1.865906 0.438533 2.756883
H  -3.716129 0.034604 -1.958509
