program: Gaussian 09
title: 000160396
version: EM64L-G09RevD.01
frameworkgroup: C1[X(C18H18O6)]
method: RPBEPBE
basis: SDD
operation: Freq
keyword: #pfreq=noraman
keyword: PBEPBE/SDD
title: #p freq=noraman PBEPBE/SDD
converged: YES YES NO NO
title: Mulliken charges:
elementType: O O O O O O C C C C C C C C C C C C C C C C C C H H H H H H H H H H H H H H H H H H
charge: -0.281787 -0.186141 -0.361223 -0.399699 -0.418607 -0.263984 -0.171815 -0.536813 0.101691 0.120455 0.085897 0.311817 0.168108 -0.001201 0.100151 -0.001475 0.096804 -0.367650 -0.798846 -0.838781 -0.495231 -0.381638 0.357775 -0.537109 0.203788 0.256804 0.259694 0.262115 0.234208 0.247318 0.248071 0.245753 0.210077 0.260540 0.274055 0.240164 0.366191 0.347358 0.355922 0.221035 0.245380 0.220827
chargesum: 0.00000
title: Mulliken charges with hydrogens summed into heavy atoms:
elementType: O O O O O O C C C C C C C C C C C C C C C C C C
charge: -0.281787 -0.186141 0.004968 -0.052341 -0.062686 -0.263984 0.031973 -0.020315 0.101691 0.120455 0.085897 0.311817 0.168108 -0.001201 0.100151 -0.001475 0.096804 -0.105534 -0.069249 -0.122411 -0.221176 -0.141474 0.357775 0.150134
polarizability: 3.35642058e+02 4.58844109e+00 2.32021601e+02 -5.99779192e+00 -6.58930967e+00 1.25227917e+02
1716.lowfreq: -8.2469 -3.9445 -0.0006 -0.0004 0.0009 2.2259 16.8210 26.1157 28.6640
frequency: 14.6536 26.0290 28.5638 40.5190 43.5932 62.1532 86.4480 92.3126 115.5538 136.3212 140.0715 160.7541 184.7338 212.5871 223.7180 235.0492 244.9174 255.3660 262.5513 291.1184 301.5272 316.8208 341.1931 352.0310 354.1769 361.1656 366.3529 392.5652 394.6042 421.4118 452.5721 458.4883 473.0396 506.2089 510.1737 544.8433 555.6724 573.4243 597.8913 620.1117 629.8480 645.6946 668.9409 687.5751 710.7358 729.0250 783.4760 790.9734 800.1062 819.3240 867.3954 884.0179 907.1766 915.9042 948.9039 964.8724 982.0197 1001.0631 1021.6188 1032.4498 1046.3768 1050.9011 1078.4149 1091.8427 1098.2261 1111.3030 1117.1707 1129.7360 1151.2912 1167.2707 1189.7034 1192.9722 1216.5179 1217.9861 1250.0141 1269.8394 1280.3449 1301.9356 1304.2814 1333.8002 1346.0980 1388.8555 1392.4125 1400.1645 1414.1004 1415.8050 1430.6930 1434.4613 1448.9418 1449.9730 1461.8263 1466.2124 1473.1257 1473.7729 1483.0738 1494.7805 1497.5801 1579.2566 1585.1766 1593.5807 1624.3964 1643.1116 2885.4150 2954.3126 2960.1986 2986.2561 2997.7383 3028.0210 3044.0429 3048.0767 3072.3680 3076.3454 3117.6441 3125.0389 3155.5330 3175.6697 3186.4344 3547.0149 3582.2919 3582.4191
redmass: 1.6622 4.2967 2.0501 4.3818 1.2334 7.3723 4.1633 3.4159 2.9349 3.3067 3.5211 4.3361 5.9603 3.2270 2.0106 3.9020 3.3434 1.7310 1.7984 1.7994 2.6385 1.6548 4.5051 4.3125 3.5034 4.8838 2.6042 4.1953 2.1359 5.8218 5.2336 3.6366 3.5658 6.0149 4.5217 6.7965 4.2274 3.5870 6.1605 5.1812 4.7806 7.2422 3.8521 4.8558 5.8841 3.4015 4.9739 2.7917 1.7242 3.9815 1.6554 3.6040 4.9422 3.9785 1.3773 2.5037 3.1022 3.5259 1.6271 1.4550 1.5087 3.2005 3.1093 4.5207 2.8493 1.2592 1.4112 2.7568 1.3713 1.3317 1.4210 1.5643 2.0515 2.0744 1.4730 2.3629 1.5999 5.8800 1.3907 3.0124 2.4646 5.3953 4.0014 1.3047 1.6465 2.2530 1.1222 1.2414 3.0116 2.6183 1.0604 1.0505 1.1639 1.1152 1.1962 1.2110 2.7461 7.6743 9.8072 7.4558 7.2962 7.0186 1.0825 1.0383 1.0329 1.0426 1.0629 1.0993 1.0948 1.1039 1.0896 1.0986 1.1009 1.0994 1.0874 1.0959 1.0927 1.0650 1.0658 1.0653
irintensity: 0.3043 1.1852 1.0988 0.1777 2.0966 2.4436 0.8429 15.3776 3.2864 1.6413 1.0185 1.9453 2.9646 2.1885 0.9244 6.4026 5.2421 36.2722 66.7706 53.6978 12.8852 25.6228 2.8501 29.6780 3.6469 1.0199 6.2258 45.8557 83.7251 3.5011 1.4664 12.1196 6.8797 9.8264 17.3201 1.1580 21.0300 2.0394 2.5395 4.0796 4.8599 2.3337 16.0613 13.3615 4.5350 2.2527 6.2230 6.7552 34.4446 15.6043 34.2196 26.8573 6.1863 79.4827 3.6931 9.7098 27.3256 92.2358 47.0805 2.6885 3.3106 10.9496 118.4486 233.0856 78.9292 0.2564 179.2827 307.9718 20.7195 46.8869 21.0282 20.1322 90.7538 69.0041 2.8338 69.1886 31.2935 76.6137 16.6293 50.9898 128.8292 23.7710 102.9313 39.8940 23.5072 74.9459 13.8868 13.6820 6.1082 54.4309 16.8964 13.3946 23.3857 58.8931 3.5123 47.7164 100.8876 35.8394 458.6709 94.2245 236.9020 134.9321 45.3087 47.1770 67.9979 24.7831 4.3022 15.4490 22.4292 48.6133 14.8087 8.6232 6.1756 28.0390 5.6505 7.9441 0.2364 27.3475 43.4658 27.6408
temp: 298.150 k
press: 1.00000 atm
elementType: 8 8 8 8 8 8 6 6 6 6 6 6 6 6 6 6 6 6 6 6 6 6 6 6 1 1 1 1 1 1 1 1 1 1 1 1 1 1 1 1 1 1
symmnumber: 1
zpe: 844351.5 jmol-1
zpe.correction: 0.321597 hartree
zpe.thermalcorrener: 0.345412 hartree
zpe.thermalcorrenthalpy: 0.346356 hartree
zpe.thermalcorrgfe: 0.266249 hartree
zpe.sumelectzpe: -1146.286436 hartree
zpe.sumelectthermal: -1146.262620 hartree
zpe.sumelectthermalent: -1146.261676 hartree
zpe.sumelectthermalfe: -1146.341784 hartree
dipole: -4.2215 4.8106 -0.7756
dipole: 6.4471
quadrupole: -95.0026 -153.6370 -140.3736
quadrupole: 4.7916 -10.7743 -6.8663
quadrupole: 34.6684 -23.9659 -10.7025 4.7916 -10.7743 -6.8663
hfenergy: -1146.6080323 hartree
pointgroup: C01 [X(C18H18O6)]
dipole: 1.6647018 -1.863256 -0.4367684 debye
polarizability: 335.5853708|4.2172498|230.5021961|7.0261718|14.3208505|126.804009 unknown
InChI: InChI=1S/C18H18O6/c1-8-16(21)9(2)18-15(17(8)22)13(20)7-14(24-18)11-5-4-10(23-3)6-12(11)19/h4-6,14,19,21-22H,7H2,1-3H3
charge 0 multiplicity 1
42 atoms
O  0.172984 -0.623857 0.02222
O  1.786325 3.20636 -0.513431
O  4.243317 2.083198 -0.277492
O  4.385502 -2.807493 0.128713
O  -2.739812 2.140206 1.707753
O  -6.241859 -0.466118 -0.17485
C  -0.605933 0.600497 0.336209
C  -0.140061 1.729934 -0.600354
C  2.191357 0.817131 -0.165844
C  1.568217 -0.469832 -0.019307
C  1.358132 2.019958 -0.416377
C  -2.077273 0.26136 0.206513
C  2.29401 -1.677744 0.076018
C  3.62154 0.83933 -0.154111
C  4.401228 -0.34085 -0.04195
C  3.707738 -1.580697 0.04567
C  -3.06154 1.045841 0.877498
C  -2.525759 -0.798852 -0.611029
C  1.60097 -3.015397 0.218931
C  5.918679 -0.241814 -0.025304
C  -4.433304 0.779248 0.730194
C  -3.897285 -1.087808 -0.773935
C  -4.852584 -0.286666 -0.097035
C  -6.735508 -1.554821 -1.020953
H  -0.34689 0.870015 1.388997
H  -0.703775 2.663389 -0.428647
H  -0.32932 1.417079 -1.646229
H  -1.776336 -1.417029 -1.113737
H  1.398885 -3.469944 -0.770227
H  2.232039 -3.722835 0.779683
H  0.632161 -2.895135 0.729255
H  6.271488 0.51981 0.698814
H  6.411877 -1.17732 0.297321
H  6.340111 0.003877 -1.020568
H  -5.169846 1.393672 1.253079
H  -4.20104 -1.921876 -1.411783
H  5.227679 1.981322 -0.331625
H  5.365876 -2.680741 0.111269
H  -1.764014 2.232701 1.838671
H  -6.435751 -1.411924 -2.07743
H  -7.831168 -1.508321 -0.936999
H  -6.375459 -2.539053 -0.662992
