program: Gaussian 09
title: 000160389
version: EM64L-G09RevD.01
frameworkgroup: C1[X(C13H17N7O5)]
method: RPBEPBE
basis: SDD
operation: Freq
keyword: #p
keyword: freq=noraman
keyword: PBEPBE/SDD
title: #p freq=noraman PBEPBE/SDD
converged: YES YES NO NO
title: Mulliken charges:
elementType: O O O O O N N N N N N N C C C C C C C C C C C C C H H H H H H H H H H H H H H H H H
charge: -0.317928 -0.202865 -0.250016 -0.166642 -0.244069 -0.198941 -0.134201 -0.357354 -0.084584 0.045007 -0.026815 0.075964 -0.383513 -0.391035 -0.402255 -0.542984 -0.400160 0.281080 0.243626 0.330361 0.176172 -0.156254 -0.354603 -0.772933 -0.311656 0.219226 0.270525 0.271380 0.266793 0.266180 0.257133 0.253648 0.222934 0.247281 0.276764 0.320203 0.323570 0.291886 0.243769 0.278556 0.271554 0.265196
chargesum: 0.00000
title: Mulliken charges with hydrogens summed into heavy atoms:
elementType: O O O O O N N N N N N N C C C C C C C C C C C C C
charge: -0.317928 -0.202865 -0.250016 -0.166642 -0.244069 -0.198941 -0.134201 -0.037151 -0.084584 0.045007 -0.026815 0.075964 0.106237 0.147139 0.121058 -0.066402 0.123884 0.281080 0.243626 0.330361 0.176172 0.167317 -0.062717 0.020947 -0.046460
polarizability: 2.95471805e+02 -4.02434900e+00 2.22199211e+02 1.30354733e+01 -2.45691030e+00 1.33062490e+02
1716.lowfreq: -10.8547 -5.1341 0.0002 0.0005 0.0007 1.9910 10.8632 19.1367 22.7921
frequency: 9.3182 19.1079 22.7265 34.4616 46.2762 59.3384 70.0715 77.9482 87.4076 99.3865 106.2143 135.6927 137.4985 167.0818 180.2037 206.6738 220.0513 238.5503 263.6000 279.4606 308.0590 316.2411 328.3904 363.2196 370.3644 377.3105 402.5709 416.5677 450.2897 477.0412 523.2231 546.6531 576.5006 590.9686 600.7002 617.0261 634.1017 659.3457 664.2750 683.2136 692.1461 701.4864 722.8545 749.3801 753.4845 763.1047 783.9464 807.7850 814.8929 858.2234 869.6016 876.4183 880.4799 891.1715 935.5505 976.4203 988.6218 1020.8073 1027.0067 1049.8219 1059.4696 1079.5455 1092.8147 1103.9021 1117.2450 1138.6085 1144.2392 1162.7641 1172.9533 1173.7344 1213.4620 1229.9870 1234.1937 1252.0558 1276.6846 1293.2030 1302.4272 1310.2725 1316.1748 1323.3608 1329.0398 1339.8815 1349.4974 1356.4507 1357.2511 1360.3321 1375.5538 1380.2591 1405.4787 1411.3474 1411.6118 1446.9493 1450.1358 1454.1342 1463.5707 1464.2355 1468.7992 1476.8138 1480.9019 1482.0184 1492.4046 1495.8593 1585.2291 2981.8768 2998.8785 3002.2154 3020.1723 3049.6091 3058.7680 3059.0969 3061.3979 3072.6596 3097.2084 3118.8932 3123.6703 3129.6621 3218.8521 3246.8532 3251.4511 3562.4305
redmass: 7.3266 6.6667 7.3225 8.2560 7.5607 8.1667 7.7899 7.0183 4.9648 4.5426 4.4215 4.2881 3.8939 1.2771 4.4834 4.8380 4.7216 4.2802 3.9305 5.5254 3.2970 4.0206 2.6460 3.2854 2.7487 5.0841 5.6203 4.6976 5.1886 2.9543 3.8885 4.5633 1.6756 1.9463 4.6586 7.5140 4.2142 3.8580 4.5461 5.6778 7.3262 10.9796 3.3714 3.3231 9.0885 3.2091 2.9933 1.2800 1.5584 3.0541 1.4390 2.6534 1.5433 4.5487 3.5230 2.1206 1.6903 2.2552 4.5337 1.5353 1.7877 2.9883 2.5989 2.9302 2.5173 2.3512 3.5170 1.3382 1.7693 2.6142 3.1070 2.0080 2.7795 1.7027 1.7685 1.4553 2.4470 4.1918 1.6130 1.3035 7.7693 3.4355 2.0008 2.7577 1.6958 2.4281 1.3226 1.6588 1.8529 1.7660 2.8100 1.6780 1.3995 1.3784 1.1391 2.3182 1.0950 1.2840 1.7347 2.1374 1.4575 1.8160 5.0363 1.0407 1.0599 1.0636 1.0613 1.0652 1.0980 1.0653 1.0909 1.0965 1.1024 1.1059 1.0978 1.1067 1.0953 1.1062 1.0995 1.0788
irintensity: 2.6899 1.8750 2.2235 1.4318 1.1790 2.5842 6.3184 1.4419 5.2484 2.1039 1.2187 0.4631 9.2594 1.0814 0.9871 3.6516 0.9205 1.4591 6.4984 6.6969 10.4791 4.6009 12.0311 12.6880 1.9768 3.1737 3.6139 0.3718 4.6389 6.9155 5.1158 2.4164 64.8756 32.1378 1.2396 11.6563 2.3272 5.4941 4.3947 8.6024 4.2129 0.8510 1.2391 11.6062 32.1421 14.7991 1.8689 52.2160 41.2216 2.3223 21.9805 7.9855 1.8096 10.1550 4.0867 13.9806 2.1854 9.3024 0.3254 7.8489 12.3471 10.1309 1.4362 13.3375 60.5707 23.5202 98.1340 46.7112 5.5776 240.0107 0.2755 26.0648 73.8252 7.5865 25.3791 41.8373 106.8552 43.2695 63.0064 16.8826 350.6667 48.0216 8.4268 183.4202 11.7946 67.6210 14.2747 10.0234 34.0651 38.8302 7.2348 51.7088 17.6093 30.5206 12.9115 152.7588 12.0834 28.1556 32.6832 9.0180 3.3194 234.9375 127.0633 4.9301 17.7108 17.7442 11.8809 4.6404 16.6326 18.8977 1.0626 21.7070 2.0158 1.9479 2.7818 0.8877 31.7427 4.6037 2.9179 31.3002
temp: 298.150 k
press: 1.00000 atm
elementType: 8 8 8 8 8 7 7 7 7 7 7 7 6 6 6 6 6 6 6 6 6 6 6 6 6 1 1 1 1 1 1 1 1 1 1 1 1 1 1 1 1 1
symmnumber: 1
zpe: 833910.1 jmol-1
zpe.correction: 0.317620 hartree
zpe.thermalcorrener: 0.341285 hartree
zpe.thermalcorrenthalpy: 0.342229 hartree
zpe.thermalcorrgfe: 0.259714 hartree
zpe.sumelectzpe: -1262.930909 hartree
zpe.sumelectthermal: -1262.907244 hartree
zpe.sumelectthermalent: -1262.906300 hartree
zpe.sumelectthermalfe: -1262.988814 hartree
dipole: 2.8343 -0.6425 -0.1358
dipole: 2.9094
quadrupole: -251.1864 -145.7424 -143.3782
quadrupole: 6.5490 -4.1901 -2.3031
quadrupole: -71.0840 34.3600 36.7241 6.5490 -4.1901 -2.3031
hfenergy: -1263.2485286 hartree
pointgroup: C01 [X(C13H17N7O5)]
dipole: 1.0839691 0.011377 -0.3675612 debye
polarizability: 294.6336092|-10.1879562|137.3818235|-9.1662261|20.8573837|218.7180729 unknown
InChI: InChI=1S/C13H17N7O5/c1-10-16-9-12(19(22)23)18(10)8-5-14-11(21)3-2-6-17-7-4-15-13(17)20(24)25/h4,7,9,14H,2-3,5-6,8H2,1H3
charge 0 multiplicity 1
42 atoms
O  -0.219421 -0.565976 0.326053
O  6.875163 -0.358926 -2.048389
O  4.721768 0.072382 -2.708994
O  -7.350999 -0.264346 0.421549
O  -5.860273 -1.552707 -0.744579
N  3.901795 -0.018137 0.048436
N  -3.734751 -0.550176 0.840851
N  0.650903 -0.510455 -1.817934
N  5.190097 -0.641106 1.824001
N  5.620089 -0.177159 -1.791406
N  -5.20067 0.941785 1.775198
N  -6.157189 -0.661063 0.165472
C  -2.777746 -1.26057 -1.390599
C  2.694617 0.38033 -0.703414
C  -3.129232 -1.661684 0.059313
C  -1.770404 -0.08383 -1.526693
C  2.004361 -0.849053 -1.355216
C  -0.400491 -0.395961 -0.929557
C  3.939499 -0.261088 1.420438
C  5.206637 -0.269279 -0.429049
C  -5.060408 -0.092512 0.916861
C  -3.008184 0.26084 1.707821
C  5.976781 -0.642547 0.6871
C  2.762039 -0.103195 2.329104
C  -3.925091 1.169234 2.270277
H  -2.37062 -2.161773 -1.888856
H  -3.710807 -0.997584 -1.91972
H  2.969786 1.11385 -1.474858
H  1.997366 0.840838 0.013474
H  -3.844583 -2.497228 0.034167
H  -2.2227 -1.967918 0.604803
H  -2.173544 0.803372 -1.003708
H  -1.681931 0.183351 -2.596379
H  1.925628 -1.656074 -0.604495
H  2.603598 -1.202309 -2.209594
H  0.489491 -0.355969 -2.813975
H  -1.933625 0.124583 1.81708
H  7.029486 -0.911475 0.701335
H  2.549791 0.963772 2.535219
H  1.841558 -0.549262 1.911255
H  3.002727 -0.587876 3.287188
H  -3.734514 1.9609 2.990522
