program: Gaussian 09
title: 000160368
version: EM64L-G09RevD.01
frameworkgroup: C1[X(C20H23N5O6)]
method: RPBEPBE
basis: SDD
operation: Freq
keyword: #p
keyword: freq=noraman
keyword: PBEPBE/SDD
title: #p freq=noraman PBEPBE/SDD
converged: YES YES NO NO
title: Mulliken charges:
elementType: O O O O O O N N N N N C C C C C C C C C C C C C C C C C C C C H H H H H H H H H H H H H H H H H H H H H H H
charge: -0.257897 -0.283090 -0.397704 -0.242605 -0.418355 -0.224886 -0.395063 -0.430502 -0.048702 -0.627693 -0.448984 -0.112494 -0.447605 -0.461689 0.018863 0.270438 -0.571669 -0.041717 0.535859 0.154044 -0.467610 -0.389884 0.275033 -0.345084 -0.373308 -0.138232 -0.390636 0.150491 -0.486507 0.115090 0.181283 0.233481 0.228452 0.231309 0.280048 0.220988 0.284645 0.213942 0.200620 0.302717 0.231814 0.249428 0.209641 0.275179 0.309845 0.251069 0.284955 0.351876 0.302992 0.343572 0.271034 0.255746 0.389213 0.378252
chargesum: 0.00000
title: Mulliken charges with hydrogens summed into heavy atoms:
elementType: O O O O O O N N N N N C C C C C C C C C C C C C C C C C C C C
charge: -0.257897 -0.283090 -0.008491 -0.242605 -0.040103 -0.224886 -0.110418 -0.127785 -0.048702 0.027175 -0.105412 0.120987 0.012157 0.039346 0.018863 0.270438 -0.157107 -0.041717 0.535859 0.154044 -0.235797 -0.140457 0.275033 -0.135444 -0.098129 0.171613 0.145388 0.150491 0.040273 0.115090 0.181283
polarizability: 3.54952899e+02 1.82985524e+01 2.27697654e+02 -2.30645755e+01 2.14720729e+01 2.55229877e+02
1716.lowfreq: -7.7926 -3.6073 -0.0009 0.0003 0.0005 3.6833 4.5725 10.5437 16.3462
frequency: -3.5794 10.2569 16.3294 19.1741 24.2424 32.9468 35.3561 51.6750 53.4889 68.3133 75.5248 83.3060 89.3011 91.6850 105.1104 136.0335 147.9927 169.7092 181.5569 190.3103 200.7485 215.3270 224.5300 231.3335 253.4944 287.3860 310.5279 321.8793 326.9140 329.5406 332.9278 381.9605 401.0920 410.5080 423.2425 428.5572 468.1780 475.9114 484.2477 503.7444 511.9222 526.4577 531.7259 541.2052 565.4183 585.3867 587.6373 602.6711 619.3598 626.4933 632.5514 634.5779 636.8081 638.4261 685.3264 691.1470 726.3846 733.2282 749.4273 756.1932 767.6334 777.2034 789.9675 811.1317 829.9507 845.4718 858.2760 875.2274 878.1924 899.5986 932.0380 933.8767 936.2774 955.1071 977.8230 999.7583 1005.2117 1011.1292 1025.9700 1027.9805 1045.1347 1053.4117 1060.3848 1089.4492 1095.8259 1103.2964 1123.3166 1137.4304 1142.7724 1156.7799 1159.9043 1184.1274 1198.6784 1208.9099 1218.4420 1221.6879 1224.5157 1242.1009 1258.9509 1261.1806 1264.5349 1279.0116 1284.3544 1288.2316 1300.5561 1314.7345 1322.3132 1334.1946 1335.9046 1342.5455 1356.0766 1359.7974 1380.4172 1381.9472 1406.1382 1409.4042 1441.6387 1462.4724 1470.0769 1477.9384 1480.1646 1483.8803 1513.3107 1522.9109 1555.5803 1573.4642 1595.7622 1596.1833 1620.2479 1630.0736 1645.4453 1664.5214 1670.6113 2966.9185 2974.0650 2985.2311 2989.8176 2995.3274 3007.7717 3018.3777 3034.5530 3042.0132 3042.2012 3061.1946 3099.8697 3114.7143 3130.0850 3138.5957 3162.9431 3514.4614 3517.4508 3528.8359 3543.4776 3549.2180 3556.6909 3698.7628
redmass: 6.8601 7.4766 8.6345 9.9601 6.2148 4.3015 5.9034 8.5033 7.8203 6.2838 5.1395 4.3329 2.9731 2.7873 3.8225 4.7813 4.5813 5.0766 3.0135 3.4512 2.8792 3.1127 2.5965 5.0090 3.4546 4.6180 4.3639 1.7236 2.3727 5.0347 3.7000 3.7108 3.0129 4.2434 3.7367 3.9095 4.0812 1.7944 2.3818 1.8120 4.8558 2.3655 1.4249 3.7524 2.4873 3.1955 6.5908 1.3934 4.7429 6.3930 5.1992 6.6688 1.5442 1.5549 8.3546 3.9073 4.5314 2.8165 6.8658 3.8653 2.3880 2.1414 1.9285 3.6082 1.8383 2.4124 2.8969 2.7092 2.0593 4.4236 2.5255 2.7833 2.1121 1.4153 2.4195 1.3858 3.0650 3.0639 2.9288 3.6847 2.6708 1.9805 2.1433 2.3886 2.6189 2.6309 1.5943 2.6322 2.6884 1.9297 1.2620 1.5053 1.1731 1.2930 1.7398 1.4459 1.6748 1.4159 1.3130 1.4594 1.6828 1.6008 1.3149 1.2861 1.4604 1.3367 1.3360 1.5153 2.6693 1.8475 2.4101 2.1161 2.2262 2.9474 2.9284 3.2166 1.0946 1.0918 1.1394 1.9405 1.1142 1.1914 2.5702 3.5375 7.3650 5.6840 1.6667 6.6754 6.2713 2.7427 8.3923 6.4767 8.2581 1.0587 1.0722 1.0634 1.0618 1.0713 1.0816 1.1000 1.0628 1.1050 1.0960 1.1029 1.1038 1.0864 1.0897 1.0959 1.0952 1.0640 1.0643 1.0772 1.0670 1.0560 1.0785 1.1045
irintensity: 0.3532 2.3530 5.8763 4.4432 0.3614 0.0880 1.5660 1.1440 1.3066 2.6757 2.1363 4.4397 3.1213 2.0118 0.7898 0.9489 4.4514 3.8637 16.8351 12.0049 35.8725 7.8982 26.4483 1.8325 9.5192 3.1735 1.6636 74.1805 67.6096 5.5504 18.8231 6.4500 1.3828 10.4840 9.5838 13.1798 12.0071 212.2944 130.9007 36.3821 6.4761 24.5355 111.5076 33.3615 110.7585 18.6084 6.5935 39.0942 2.0992 3.4035 20.6946 2.6278 99.3678 107.3199 2.3946 57.5040 12.7152 14.7643 4.3420 29.0085 28.4263 5.1894 8.7504 14.1288 25.3027 0.6324 7.9207 9.8144 22.2879 17.1989 2.8142 7.5984 5.3883 2.0227 69.7327 3.4349 19.2382 4.9848 104.4420 33.5389 215.3762 16.9432 136.8261 3.9622 24.8420 68.8744 18.2497 25.0170 12.5313 4.9464 2.9449 4.8210 19.1456 6.3250 3.3080 23.5579 9.9656 10.2441 7.2585 9.3131 56.0348 27.7679 11.3967 8.6156 95.6289 1.5525 5.4091 53.8541 57.6753 42.0057 219.2575 36.0965 37.6521 23.5628 53.2622 1.2098 31.6409 6.3522 40.7211 377.9681 3.1482 26.3398 90.9324 186.0334 108.7461 373.7927 76.2839 85.0217 76.0399 348.0583 137.9411 521.1586 221.1781 23.2322 24.2367 17.4282 9.6221 74.5223 15.0626 14.2959 9.7849 43.4486 5.1801 20.1316 9.1400 20.7754 14.1036 17.3466 2.6758 21.9786 45.9152 40.0895 24.5064 84.5855 21.4239 39.1335
temp: 298.150 k
press: 1.00000 atm
elementType: 8 8 8 8 8 8 7 7 7 7 7 6 6 6 6 6 6 6 6 6 6 6 6 6 6 6 6 6 6 6 6 1 1 1 1 1 1 1 1 1 1 1 1 1 1 1 1 1 1 1 1 1 1 1
symmnumber: 1
zpe: 1100192.7 jmol-1
zpe.correction: 0.419041 hartree
zpe.thermalcorrener: 0.448731 hartree
zpe.thermalcorrenthalpy: 0.449675 hartree
zpe.thermalcorrgfe: 0.352914 hartree
zpe.sumelectzpe: -1498.806531 hartree
zpe.sumelectthermal: -1498.776841 hartree
zpe.sumelectthermalent: -1498.775897 hartree
zpe.sumelectthermalfe: -1498.872659 hartree
dipole: 5.8921 -1.1509 -12.2742
dipole: 13.6637
quadrupole: -108.1990 -165.5921 -191.4312
quadrupole: 11.3239 -33.1792 -8.4884
quadrupole: 46.8751 -10.5180 -36.3571 11.3239 -33.1792 -8.4884
hfenergy: -1499.2255722 hartree
pointgroup: C01 [X(C20H23N5O6)]
dipole: -2.3544849 -0.1227724 4.8311251 debye
polarizability: 355.8892955|-17.7394127|224.0036457|-20.535426|-19.6296471|257.9874892 unknown
InChI: InChI=1S/C20H23N5O6/c21-20-24-16-15(18(29)25-20)12(9-22-16)6-3-10-1-4-11(5-2-10)17(28)23-13(19(30)31)7-8-14(26)27/h1-2,4-5,12-13,22-24,26,30H,3,6-9,21H2
charge 0 multiplicity 1
54 atoms
O  -5.000424 0.436276 -2.40798
O  3.92768 -0.852669 -2.168912
O  7.847639 -0.853459 1.075083
O  5.901923 -1.171544 2.301127
O  5.376157 4.332376 0.944576
O  6.449141 3.748128 -1.030088
N  -5.778334 -0.696146 2.115733
N  -6.936131 1.258801 1.155893
N  -6.529872 1.755143 -1.179199
N  -7.968644 3.109189 0.088947
N  4.326173 -0.788675 0.108827
C  -4.573339 -1.389106 0.104248
C  -4.947038 -1.822062 1.576109
C  -3.06857 -1.056257 -0.0850
C  -5.459124 -0.172257 -0.1208
C  -6.100598 0.15024 1.05983
C  -2.171657 -2.324947 -0.087426
C  -5.606035 0.652028 -1.311271
C  -0.701246 -1.999331 -0.293928
C  -7.11783 2.019339 -0.030012
C  0.231264 -2.097987 0.769943
C  -0.226457 -1.568963 -1.562357
C  2.055834 -1.335488 -0.685952
C  1.590923 -1.770955 0.582343
C  1.129127 -1.247528 -1.75722
C  5.756597 -0.532908 -0.08458
C  6.076457 0.929532 -0.525959
C  3.488023 -0.982134 -0.979281
C  5.583077 1.981653 0.481686
C  6.465042 -0.891937 1.216243
C  5.864872 3.396654 0.016932
H  -4.828567 -2.196677 -0.609986
H  -5.529949 -2.763726 1.586491
H  -4.0461 -1.961572 2.20056
H  -2.95978 -0.526753 -1.049091
H  -2.73745 -0.358787 0.709648
H  -6.398801 -0.848802 2.911487
H  -2.526589 -2.992072 -0.899064
H  -2.30059 -2.878952 0.863603
H  -7.27817 1.591996 2.058238
H  -0.109905 -2.44376 1.753363
H  -0.92811 -1.489557 -2.401406
H  2.277026 -1.894683 1.429229
H  1.504614 -0.92938 -2.735226
H  6.132695 -1.192728 -0.890794
H  7.16577 1.020713 -0.67865
H  5.59316 1.082106 -1.505523
H  -8.086134 3.670176 -0.751766
H  -8.619632 3.225284 0.861296
H  4.006417 -0.912155 1.07254
H  4.493124 1.887962 0.648804
H  6.053235 1.860211 1.477899
H  8.282482 -1.082518 1.940839
H  5.570421 5.251066 0.612851
