program: Gaussian 09
title: 000160334
version: EM64L-G09RevD.01
frameworkgroup: C1[X(C18H9NO3)]
method: RPBEPBE
basis: SDD
operation: Freq
keyword: #p
keyword: freq=noraman
keyword: PBEPBE/SDD
title: #p freq=noraman PBEPBE/SDD
converged: NO YES YES YES
title: Mulliken charges:
elementType: O O O N C C C C C C C C C C C C C C C C C C H H H H H H H H H
charge: -0.206062 -0.218923 -0.194722 0.044421 -0.013341 0.006387 0.459814 0.554997 0.094048 0.476375 0.468441 0.125731 -0.645592 -0.471225 -0.489917 -0.485506 -0.476878 -0.420326 -0.456330 -0.454540 0.263410 -0.241679 0.275053 0.242232 0.249004 0.244810 0.243569 0.297241 0.248624 0.246897 0.233987
chargesum: 0.00000
title: Mulliken charges with hydrogens summed into heavy atoms:
elementType: O O O N C C C C C C C C C C C C C C C C C C
charge: -0.206062 -0.218923 -0.194722 0.044421 -0.013341 0.006387 0.459814 0.554997 0.094048 0.476375 0.468441 0.125731 -0.370539 -0.228993 -0.240912 -0.240697 -0.233309 -0.123085 -0.207706 -0.207643 0.263410 -0.007692
polarizability: 5.16885331e+02 6.90484644e+00 2.38587418e+02 -4.43998214e-03 1.53158978e-03 7.72018002e+01
1716.lowfreq: -0.0008 -0.0005 0.0006 5.2353 10.8779 15.5359 47.4505 60.5500 106.6258
frequency: 47.4083 60.5468 106.6245 110.3982 137.2730 204.4475 210.0355 228.3097 236.5638 269.1131 320.0753 358.4932 386.9153 415.1170 428.2942 464.7580 479.8766 501.7953 509.1419 527.2264 533.6373 546.2092 558.6993 563.5333 591.1689 643.2431 669.9425 678.2170 703.0567 728.6241 750.1200 750.2700 773.3006 776.5863 806.8245 823.5000 845.1983 867.0042 874.4824 879.9724 896.8755 900.9045 923.5402 976.1381 979.9335 988.9443 995.3450 997.0103 1073.4750 1085.6281 1115.2007 1126.8204 1159.0856 1176.8354 1183.6448 1196.4684 1230.5858 1237.9507 1257.2483 1272.8109 1294.0937 1335.9927 1347.8055 1391.3613 1403.7738 1409.5454 1420.9626 1429.9962 1447.0061 1477.2480 1496.9717 1510.0730 1519.1408 1561.5241 1599.4502 1603.5468 1622.4243 1633.3060 3127.1263 3128.4858 3130.2593 3136.7247 3150.9323 3154.6209 3162.2428 3172.0777 3249.8430
redmass: 7.6739 12.5980 6.8564 9.4172 4.9915 5.1908 4.1358 4.9392 8.7526 9.4896 4.4738 6.1624 7.0067 3.7292 7.7171 7.5683 5.0411 5.4792 3.8235 7.1712 3.8535 3.5543 4.3648 7.1124 6.7268 7.7877 4.2308 8.1356 3.8202 12.2513 6.3081 2.9725 1.2656 5.2057 5.1401 1.5220 2.2469 2.1089 4.1191 1.5152 1.7325 9.2295 1.4648 6.0169 1.3486 1.3915 1.4162 6.1081 2.3500 2.2777 2.9536 2.4739 1.3922 1.2575 1.9792 1.3159 3.9900 1.6861 1.8804 2.9752 4.6201 3.2836 12.9663 2.9235 3.6210 3.1964 3.1822 3.3115 5.8100 5.5156 4.4256 6.0583 8.1424 5.7287 6.4152 7.7984 7.7665 7.4365 1.0866 1.0866 1.0869 1.0919 1.0983 1.0978 1.0990 1.0934 1.0989
irintensity: 0.4420 0.0000 0.3299 1.2080 0.9462 5.1918 3.1977 6.1662 1.2013 1.1147 1.1986 0.0350 4.3634 0.9490 0.1446 0.4899 2.7076 3.5305 1.0920 1.2282 0.0505 1.4682 0.0737 0.3531 0.5021 0.9975 7.1659 5.0121 12.3109 20.6381 5.3206 22.6584 8.6720 2.2815 5.5212 1.3891 8.1515 41.9153 1.0671 21.4790 104.3094 6.7238 4.1620 0.6801 0.9591 0.8783 1.4034 5.7220 11.7689 6.6273 26.6198 6.1038 6.6604 14.0313 362.7411 83.0214 532.8409 4.4272 3.4622 38.0348 50.9771 12.0040 139.3365 3.2081 3.8755 2.1634 1.2239 4.0471 1.9163 1.0451 2.2230 1.2337 285.3648 38.9140 37.1689 7.3579 107.2987 10.8848 0.4085 0.3355 0.8355 11.8497 28.0178 15.9893 43.1495 0.7592 3.8821
temp: 298.150 k
press: 1.00000 atm
elementType: 8 8 8 7 6 6 6 6 6 6 6 6 6 6 6 6 6 6 6 6 6 6 1 1 1 1 1 1 1 1 1
symmnumber: 1
zpe: 580529.7 jmol-1
zpe.correction: 0.221112 hartree
zpe.thermalcorrener: 0.236028 hartree
zpe.thermalcorrenthalpy: 0.236972 hartree
zpe.thermalcorrgfe: 0.179046 hartree
zpe.sumelectzpe: -970.231637 hartree
zpe.sumelectthermal: -970.216722 hartree
zpe.sumelectthermalent: -970.215778 hartree
zpe.sumelectthermalfe: -970.273703 hartree
dipole: -8.7607 -0.4205 0.0011
dipole: 8.7707
quadrupole: -151.2852 -108.4598 -129.2459
quadrupole: -0.9022 0.0072 -0.0002
quadrupole: -21.6216 21.2039 0.4177 -0.9022 0.0072 -0.0002
hfenergy: -970.4527494 hartree
pointgroup: C01 [X(C18H9N1O3)]
dipole: 3.4479361 -0.1375081 -0.0004397 debye
polarizability: 516.978972|-4.6484477|238.4937769|-0.0044274|-0.0015675|77.2018002 unknown
InChI: InChI=1S/C18H9NO3/c20-19(21)16-9-14-13-7-6-11-3-1-2-10-4-5-12(8-15(14)22-16)18(13)17(10)11/h1-9H
charge 0 multiplicity 1
31 atoms
O  -3.189998 1.130696 -0.000197
O  -5.554376 -1.575223 0.000307
O  -5.869567 0.705858 0.000416
N  -5.1208 -0.348134 -0.000226
C  0.913937 0.24809 -0.000077
C  2.312026 -0.091471 -0.000038
C  -0.069764 -0.805744 -0.000093
C  0.516188 1.649332 -0.000103
C  -1.447789 -0.420786 -0.000136
C  2.721364 -1.475122 -0.000014
C  3.315475 0.945332 -0.000025
C  -1.785632 0.969696 -0.000156
C  -0.859205 2.011612 -0.000144
C  0.359563 -2.179206 -0.00007
C  1.547332 2.664118 -0.000087
C  1.707907 -2.501779 -0.00003
C  2.88833 2.328165 -0.000051
C  -2.69286 -1.142564 -0.000175
C  4.110155 -1.792136 0.000021
C  4.688596 0.585935 0.000011
C  -3.695201 -0.183448 -0.000217
C  5.080581 -0.771793 0.000035
H  -1.173074 3.058579 -0.000163
H  -0.395123 -2.97264 -0.00008
H  1.239356 3.715606 -0.000105
H  2.0253 -3.550837 -0.000009
H  3.655104 3.111403 -0.00004001
H  -2.861993 -2.215984 -0.000176
H  4.417413 -2.844188 0.000037
H  5.447986 1.376328 0.000021
H  6.144468 -1.030695 0.000062
