program: Gaussian 09
title: 000160332
version: EM64L-G09RevD.01
frameworkgroup: C1[X(C18H9NO3)]
method: RPBEPBE
basis: SDD
operation: Freq
keyword: #p
keyword: freq=noraman
keyword: PBEPBE/SDD
title: #p freq=noraman PBEPBE/SDD
converged: YES YES NO YES
title: Mulliken charges:
elementType: O O O N C C C C C C C C C C C C C C C C C C H H H H H H H H H
charge: -0.209076 -0.211394 -0.191954 0.049807 0.049890 0.019225 0.376030 0.509634 -0.070640 0.472004 0.473630 0.324884 -0.680588 -0.460566 -0.497846 -0.463913 -0.477711 -0.455524 -0.457908 -0.437656 0.278795 -0.240239 0.266410 0.272887 0.245702 0.245644 0.241515 0.247137 0.245779 0.303576 0.232467
chargesum: 0.00000
title: Mulliken charges with hydrogens summed into heavy atoms:
elementType: O O O N C C C C C C C C C C C C C C C C C C
charge: -0.209076 -0.211394 -0.191954 0.049807 0.049890 0.019225 0.376030 0.509634 -0.070640 0.472004 0.473630 0.324884 -0.414178 -0.187679 -0.252144 -0.218269 -0.236196 -0.208387 -0.212129 -0.134080 0.278795 -0.007773
polarizability: 4.60830975e+02 -1.52653944e+01 2.44198533e+02 2.05663229e-02 6.92918641e-03 7.71477708e+01
1716.lowfreq: -3.6971 -0.0002 0.0005 0.0008 4.8271 11.2795 47.6514 57.9390 105.1407
frequency: 47.6312 57.9354 105.1406 106.0274 136.1719 203.4622 209.9784 229.3977 239.2373 266.8871 330.1374 344.8119 387.1570 422.7858 423.9484 464.5325 481.3030 497.3618 510.8681 522.8629 531.6636 547.2887 563.6272 565.2788 590.8762 648.4684 668.6582 682.0602 703.2033 729.4439 749.7603 751.8749 762.5332 772.9686 804.9103 823.4872 843.4171 862.5261 869.2189 874.8504 902.3230 908.2087 923.5085 974.1489 981.8005 991.1115 997.0908 1036.1113 1074.0763 1087.3106 1106.1114 1124.3048 1158.7510 1175.6704 1182.3739 1193.9522 1219.8333 1238.3239 1255.5469 1257.3927 1324.5769 1332.2693 1355.3985 1383.3244 1394.6746 1410.8451 1425.2177 1431.2795 1438.4894 1461.7922 1491.7793 1504.3081 1539.0711 1567.9705 1599.4736 1605.7603 1623.9571 1639.5541 3124.7120 3127.9216 3135.6698 3137.1591 3148.9041 3152.5829 3161.1593 3166.2913 3249.1762
redmass: 7.8234 12.3303 5.8301 9.5579 6.1296 4.8480 4.4948 4.5625 8.8252 9.5493 4.6155 6.1482 6.9583 3.6935 7.2238 7.3376 5.4941 5.8287 3.7963 4.2112 8.9619 3.2601 6.7834 4.7411 5.0135 7.5082 3.8357 8.1159 3.9177 10.0022 6.6121 3.1817 5.8140 1.2617 5.0768 1.4749 2.3645 1.8366 6.7644 1.6635 8.0900 1.7036 1.5072 5.4374 1.3488 1.3809 1.3917 4.1371 2.0217 3.7693 2.8216 2.3893 1.4985 1.3157 2.2769 1.3296 2.0612 1.6612 2.4866 2.8831 4.0690 3.3065 13.1262 2.0270 6.6981 2.4758 4.9251 3.1617 6.2104 4.7392 3.8203 7.3220 7.3319 5.3700 8.3974 6.6127 7.5403 7.7699 1.0863 1.0864 1.0897 1.0905 1.0982 1.0929 1.0990 1.0973 1.0993
irintensity: 0.1853 0.1249 2.0442 1.3620 0.3864 10.2771 0.2544 4.1686 1.7075 0.0925 0.4338 1.2621 1.6256 0.0901 2.9866 2.2530 0.3203 3.5574 0.5085 0.2484 0.7123 0.6776 0.5689 0.0043 0.4548 9.7010 0.0142 7.3134 9.8644 7.0669 10.1324 41.8125 23.2418 5.9702 9.1745 4.8925 1.7903 35.8261 4.6746 24.3597 13.4754 93.8955 12.1702 2.0086 2.4882 0.0094 1.0581 10.4371 3.8489 19.0263 10.2026 13.1566 8.5330 84.7538 181.8950 79.9114 124.1085 3.7951 140.8482 108.6113 0.2572 9.2101 140.3751 3.2195 14.1983 1.2916 2.1356 1.8364 7.7977 8.5898 45.3312 1.3820 202.9913 31.8083 1.9593 3.2631 10.5612 10.5285 0.5805 0.2784 0.4291 17.3876 22.5932 11.5749 40.5485 8.1710 5.3218
temp: 298.150 k
press: 1.00000 atm
elementType: 8 8 8 7 6 6 6 6 6 6 6 6 6 6 6 6 6 6 6 6 6 6 1 1 1 1 1 1 1 1 1
symmnumber: 1
zpe: 580517.9 jmol-1
zpe.correction: 0.221108 hartree
zpe.thermalcorrener: 0.236039 hartree
zpe.thermalcorrenthalpy: 0.236983 hartree
zpe.thermalcorrgfe: 0.178973 hartree
zpe.sumelectzpe: -970.229325 hartree
zpe.sumelectthermal: -970.214393 hartree
zpe.sumelectthermalent: -970.213449 hartree
zpe.sumelectthermalfe: -970.271459 hartree
dipole: 7.1269 2.4384 0.0015
dipole: 7.5325
quadrupole: -143.8930 -109.1622 -129.3051
quadrupole: -11.1033 -0.0080 -0.0009
quadrupole: -16.4396 18.2913 -1.8517 -11.1033 -0.0080 -0.0009
hfenergy: -970.4504322 hartree
pointgroup: C01 [X(C18H9N1O3)]
dipole: 2.8065398 -0.9516725 -0.000603 debye
polarizability: 460.7458758|15.8575016|244.283633|-0.0205852|0.0068729|77.1477708 unknown
InChI: InChI=1S/C18H9NO3/c20-19(21)15-9-13-8-12-5-4-10-2-1-3-11-6-7-14(18(13)22-15)17(12)16(10)11/h1-9H
charge 0 multiplicity 1
31 atoms
O  -2.645559 0.910497 -0.000036
O  -5.970018 -0.447907 0.00055
O  -5.22791 1.728985 0.000708
N  -5.033408 0.452206 0.00002
C  0.908815 -0.302216 -0.000142
C  2.270945 0.154492 -0.000158
C  -0.154615 0.674899 -0.000102
C  0.619806 -1.731169 -0.000163
C  -1.460249 0.143666 -0.000082
C  2.561086 1.56982 -0.000136
C  3.355884 -0.797544 -0.000198
C  -1.770936 -1.250583 -0.000108
C  -0.716052 -2.19639 -0.000148
C  0.148145 2.084801 -0.000081
C  1.736371 -2.657676 -0.000205
C  1.464626 2.511761 -0.000098
C  3.042788 -2.212895 -0.000222
C  3.917641 1.999971 -0.000155
C  4.692937 -0.32432 -0.000217
C  -3.213692 -1.344949 -0.00009
C  -3.682501 -0.042299 -0.00005
C  4.968701 1.062033 -0.000195
H  -0.923317 -3.271153 -0.000171
H  -0.679353 2.8006 -0.000053
H  1.516391 -3.731391 -0.000225
H  1.696811 3.582753 -0.000083
H  3.872637 -2.928897 -0.000257
H  4.137057 3.073702 -0.00014
H  5.516583 -1.04744 -0.000248
H  -3.834457 -2.237089 -0.000104
H  6.007442 1.408831 -0.00021
