program: Gaussian 09
title: 000160274
version: EM64L-G09RevD.01
frameworkgroup: C1[X(C17H14ClNO3)]
method: RPBEPBE
basis: SDD
operation: Freq
keyword: #p
keyword: freq=noraman
keyword: PBEPBE/SDD
title: #p freq=noraman PBEPBE/SDD
converged: YES YES NO NO
title: Mulliken charges:
elementType: Cl O O O N C C C C C C C C C C C C C C C C C H H H H H H H H H H H H H H
charge: -0.060754 -0.432477 -0.203788 -0.262477 -0.432597 -0.030380 0.371243 0.100157 -0.592227 0.079665 0.467919 -0.426458 0.192641 -0.318079 -0.265037 -0.806245 0.312281 -0.349060 -0.332403 -0.239241 -0.225580 -0.221547 0.237975 0.265450 0.333391 0.258750 0.378574 0.257239 0.241777 0.257689 0.230854 0.222989 0.282398 0.233559 0.237216 0.236583
chargesum: 0.00000
title: Mulliken charges with hydrogens summed into heavy atoms:
elementType: Cl O O O N C C C C C C C C C C C C C C C C C
charge: -0.060754 -0.053903 -0.203788 -0.262477 -0.099206 -0.030380 0.371243 0.100157 -0.088802 0.079665 0.467919 -0.167708 0.192641 -0.318079 -0.007798 -0.075925 0.312281 -0.126071 -0.050005 -0.005681 0.011636 0.015036
polarizability: 3.12259550e+02 -6.95111616e+00 1.70415559e+02 -2.48154836e+01 -4.75152496e+00 1.57401262e+02
1716.lowfreq: -3.5777 0.0004 0.0006 0.0008 4.3349 6.5032 15.6125 20.7201 28.1690
frequency: 15.4373 20.6958 28.1609 63.5327 83.2348 95.9235 101.9391 146.9910 154.6544 168.3381 181.9344 207.1774 233.4900 262.6254 267.6231 274.2953 296.3720 331.5547 356.4222 397.5503 399.7305 416.5810 431.5371 473.2831 501.9958 527.5595 558.9454 578.9818 595.0375 599.0256 607.2755 613.3478 631.6171 677.9959 689.6579 690.5316 701.5484 727.6684 752.9610 764.7564 798.7057 812.4243 846.5875 854.7752 875.1197 889.5597 941.9016 943.1356 979.0853 989.4677 991.5162 996.4677 1011.3062 1016.1443 1027.3369 1041.8079 1057.5751 1060.6051 1090.4139 1123.9499 1173.4306 1175.6395 1191.1527 1199.4109 1214.7400 1230.9852 1241.5652 1274.5986 1302.8584 1319.7125 1331.9265 1389.7147 1394.5213 1403.3447 1414.7643 1423.7885 1435.8243 1443.8745 1455.0534 1480.8446 1482.5372 1483.5743 1544.3126 1590.8821 1609.6200 1617.3958 1619.6889 1668.8744 2973.9855 2995.5429 3045.9142 3085.5391 3112.9515 3132.1825 3142.3518 3153.0934 3153.4863 3163.8617 3173.5568 3179.7597 3227.0868 3574.4093
redmass: 4.9133 4.2729 7.9647 5.6185 7.9942 1.0999 5.0490 4.8537 4.6586 8.4095 5.1188 4.6661 6.1678 4.0846 5.5746 5.3665 4.6409 6.0909 11.4761 2.7748 4.9456 3.1415 4.7291 6.5856 6.4325 3.7269 3.2822 5.5390 2.1755 2.0481 3.3372 5.5739 5.6811 4.5882 1.3535 1.9071 3.2266 6.1193 3.5022 3.1535 2.9195 1.4579 4.3465 1.2543 3.2400 4.1453 1.3803 1.4356 3.4112 5.7936 1.4231 2.7959 1.5433 2.0392 2.1007 1.4834 2.7909 5.8609 1.6374 1.6357 1.8156 1.1173 1.2477 1.6610 2.0027 3.1779 1.9054 2.7596 1.7366 2.1052 1.5233 8.8175 4.2604 1.2790 1.6250 1.1500 2.2340 1.9344 4.2899 2.2503 1.1462 1.2229 5.8547 6.1152 6.0658 7.5256 8.1912 10.1325 1.0400 1.0648 1.0981 1.0949 1.0951 1.0853 1.0882 1.0900 1.0927 1.0961 1.1007 1.0960 1.0660 1.0793
irintensity: 0.1836 0.3518 0.4683 2.3496 0.3148 0.3592 1.2158 0.5870 0.2539 0.7307 3.9079 2.4498 4.2197 3.7597 7.1885 10.3345 2.5381 15.4760 15.9723 0.1131 4.9880 1.1681 8.1745 4.2512 19.8910 1.7551 4.7201 9.3855 14.5416 43.2674 63.3665 12.6990 1.2684 56.8280 134.0520 16.9119 58.6478 6.7574 14.7967 41.7548 13.2589 37.0187 5.5753 1.0102 6.6234 22.5851 1.3568 2.9443 12.4476 4.1486 0.8099 125.1026 5.4424 5.6338 8.9955 1.9122 45.6808 50.3344 3.2157 20.8402 70.3814 16.0557 20.8923 1.2814 95.6465 176.6588 69.4768 42.2578 64.6216 8.0446 80.1007 6.6817 5.3428 19.1768 280.6919 17.1176 9.0459 70.4933 40.7776 4.3809 37.2774 33.8428 100.3260 11.8369 19.2678 112.2405 59.4250 385.4612 23.1981 3.0785 17.2180 8.6381 5.0885 0.3479 5.1921 3.2462 22.7371 14.3667 22.7457 2.0939 367.4197 33.0267
temp: 298.150 k
press: 1.00000 atm
elementType: 17 8 8 8 7 6 6 6 6 6 6 6 6 6 6 6 6 6 6 6 6 6 1 1 1 1 1 1 1 1 1 1 1 1 1 1
symmnumber: 1
zpe: 707018.3 jmol-1
zpe.correction: 0.269289 hartree
zpe.thermalcorrener: 0.288834 hartree
zpe.thermalcorrenthalpy: 0.289778 hartree
zpe.thermalcorrgfe: 0.218819 hartree
zpe.sumelectzpe: -1395.164745 hartree
zpe.sumelectthermal: -1395.145201 hartree
zpe.sumelectthermalent: -1395.144257 hartree
zpe.sumelectthermalfe: -1395.215216 hartree
dipole: -1.5496 -4.8757 -0.9026
dipole: 5.1951
quadrupole: -123.3269 -138.6449 -129.4862
quadrupole: 8.2551 9.1971 -3.9484
quadrupole: 7.1591 -8.1589 0.9998 8.2551 9.1971 -3.9484
hfenergy: -1395.4340345 hartree
pointgroup: C01[X(C17H14Cl1N1O3)]
dipole: 0.7055145 -1.5571839 -1.1202444 debye
polarizability: 309.0864112|31.5067553|162.2460199|-12.5014122|5.7198509|168.74394 unknown
InChI: InChI=1S/C17H14ClNO3/c1-10-13(18)8-7-12-15(10)19-16(21)17(12,22)9-14(20)11-5-3-2-4-6-11/h2-8,19,22H,9H2,1H3
charge 0 multiplicity 1
36 atoms
Cl -6.068201 -1.598062 -0.206259
O  -0.444724 1.606111 1.862328
O  0.552253 2.076306 -1.090144
O  2.222537 1.331715 1.687003
N  -1.62313 1.162851 -1.280924
C  -0.468327 0.659122 0.756834
C  -1.832907 -0.009582 0.701445
C  -2.47634 0.325024 -0.515137
C  0.711189 -0.362254 0.842905
C  -0.405548 1.406442 -0.632566
C  -3.770458 -0.119909 -0.869004
C  -2.489796 -0.81074 1.642118
C  2.084285 0.320215 0.920231
C  -4.38784 -0.940854 0.111094
C  -3.789847 -1.288752 1.340415
C  -4.400414 0.28499 -2.184877
C  3.258169 -0.20806 0.163976
C  3.216858 -1.405038 -0.602495
C  4.477018 0.52461 0.236821
C  4.36913 -1.857523 -1.27976
C  5.623286 0.074808 -0.443297
C  5.572956 -1.119335 -1.203952
H  0.640775 -1.070121 0.00204
H  0.573795 -0.941867 1.777967
H  -1.854903 1.565851 -2.189026
H  -2.024605 -1.049942 2.603278
H  0.524774 1.849539 2.007289
H  -4.33537 -1.915472 2.050287
H  -4.551236 1.380788 -2.233838
H  -5.382649 -0.191199 -2.323237
H  -3.762089 -0.005876 -3.041379
H  2.297077 -1.994471 -0.672556
H  4.490145 1.444201 0.830344
H  4.329506 -2.781866 -1.865811
H  6.554117 0.648962 -0.385992
H  6.465113 -1.470813 -1.734119
