program: Gaussian 09
title: 000160263
version: EM64L-G09RevD.01
frameworkgroup: C1[X(C19H22N2O)]
method: RPBEPBE
basis: SDD
operation: Freq
keyword: #p
keyword: freq=noraman
keyword: PBEPBE/SDD
title: #p freq=noraman PBEPBE/SDD
converged: YES YES NO NO
title: Mulliken charges:
elementType: O N N C C C C C C C C C C C C C C C C C C C H H H H H H H H H H H H H H H H H H H H H H
charge: -0.258324 -0.181340 -0.427626 0.341146 -0.509292 0.268694 -0.471141 -0.452572 -0.453109 -0.386463 0.062196 -0.521070 -0.236729 -0.416627 -0.746053 0.218404 0.116346 0.168876 -0.384831 -0.372098 -0.256341 -0.235236 0.220962 0.209512 0.204552 0.247166 0.231159 0.204302 0.208562 0.231986 0.221301 0.231552 0.242398 0.226606 0.243954 0.258948 0.222154 0.227673 0.219835 0.315885 0.250658 0.254598 0.229194 0.230233
chargesum: 0.00000
title: Mulliken charges with hydrogens summed into heavy atoms:
elementType: O N N C C C C C C C C C C C C C C C C C C C
charge: -0.258324 -0.181340 -0.111741 0.341146 -0.078818 0.268694 -0.019423 -0.017112 -0.012561 0.066390 0.062196 -0.052065 0.007225 -0.157679 -0.076391 0.218404 0.116346 0.168876 -0.134173 -0.117500 -0.027148 -0.005002
polarizability: 2.56396853e+02 -1.31391341e+01 1.86372177e+02 1.10870028e+01 -7.28915025e-01 1.87399178e+02
1716.lowfreq: -10.3183 -5.6046 -0.0005 -0.0004 0.0003 5.7965 46.9911 50.8783 69.6790
frequency: 46.9086 50.8401 69.6671 81.2400 91.0729 110.5012 139.1192 169.8773 180.9800 212.7519 215.1502 254.3570 288.8667 295.9428 299.1654 316.8687 331.1583 353.9222 374.7963 392.6699 415.2509 441.3323 451.2330 476.9723 494.9228 508.7775 526.8061 560.4067 580.7508 598.9259 618.3712 633.6278 650.4974 679.5052 694.5001 708.6459 728.9539 750.0176 760.9801 768.8915 778.8436 808.3529 835.8958 858.3142 877.3015 890.6508 900.5110 911.6124 923.6724 946.2234 959.7870 965.1469 985.2290 991.8433 995.0035 1034.8043 1042.9084 1059.4914 1071.5719 1082.3261 1084.1003 1089.4050 1122.0350 1132.0611 1158.3322 1167.2000 1169.8455 1185.1507 1200.5177 1211.2934 1216.7245 1235.2919 1248.0138 1258.5723 1276.5820 1294.1821 1300.4784 1319.1446 1335.9400 1337.6301 1338.7575 1342.3877 1352.9133 1356.4592 1371.4475 1384.6406 1385.6768 1391.1168 1419.0558 1434.3976 1454.7698 1459.6113 1465.1929 1467.5484 1471.7120 1477.9831 1482.2533 1487.2858 1491.9229 1501.5291 1549.8268 1571.8708 1605.7279 1620.5337 2964.2304 2969.6591 2980.0905 2982.2403 2985.2038 3003.3559 3004.8268 3038.4533 3040.2818 3042.2114 3046.1297 3065.0688 3070.1795 3074.0345 3079.7906 3126.1739 3135.8998 3148.2454 3164.2101 3203.7425 3230.5896 3494.9100
redmass: 4.3312 5.6356 4.0948 3.7463 3.1359 2.9546 3.3868 2.9825 3.8152 3.5734 1.4644 3.3630 2.8538 2.8513 2.3745 2.7971 3.5873 2.1128 3.7145 4.9514 2.8813 4.2236 3.6095 2.3572 2.3038 4.2457 3.1131 3.1156 2.2107 3.0245 3.6673 5.1123 4.0824 2.8710 1.9919 3.3543 2.2384 3.0260 2.4019 1.3148 1.6388 2.9097 1.3415 1.8686 1.7429 1.8487 2.2727 2.0852 3.1356 3.0891 1.4894 2.1529 1.7959 1.3263 2.4185 2.2140 1.7365 2.3271 1.7125 1.8700 2.7004 2.0392 1.7946 1.7675 1.8051 1.9123 1.0676 1.7623 1.6202 1.8453 1.8255 2.0213 1.3649 1.4711 1.2491 1.3992 1.4455 1.9362 1.9483 1.4457 1.7939 2.0075 4.8805 1.5835 2.3953 1.5603 2.1855 1.2841 3.5084 2.4564 1.1290 1.6025 1.4172 1.1201 1.1176 1.0916 1.4687 1.0732 1.0729 2.1102 6.6873 6.8651 6.4649 6.1928 1.0649 1.0640 1.0396 1.0625 1.0589 1.0633 1.0629 1.0977 1.0973 1.0982 1.0964 1.1031 1.0981 1.0970 1.0995 1.0849 1.0895 1.0950 1.1010 1.0899 1.1072 1.0749
irintensity: 1.8529 1.1451 0.4611 0.6124 0.7405 0.3664 0.3527 1.7850 1.0011 0.1155 0.8304 2.3023 3.2423 0.4441 1.6305 0.5130 1.3900 3.9158 1.7374 2.8452 0.7688 2.4512 10.9147 21.9774 6.2274 4.4482 11.5937 12.1252 57.0151 7.4812 1.1565 7.5430 10.4004 46.6227 25.2671 1.0821 25.6797 14.4446 14.3265 33.4592 19.1090 0.7761 2.5814 3.1791 5.5310 3.5392 3.8579 2.6921 17.5393 0.7956 1.6759 1.9315 3.9493 0.0597 16.2338 8.0063 1.0609 4.1916 6.7975 2.1552 4.4629 5.1810 8.1400 2.8854 6.2540 3.2654 0.2142 21.5145 13.0518 12.6290 16.5685 9.3101 7.3946 5.0804 5.9517 11.7555 53.9760 14.8112 17.0181 11.2626 2.0604 1.8712 2.8085 2.9468 76.1495 5.4194 24.0077 13.8009 7.6000 10.6189 14.9676 13.1542 5.9122 8.4002 31.8736 5.9497 30.8406 9.7316 6.3923 40.5812 8.8064 8.7386 72.3395 228.9062 62.2898 29.3398 26.0217 23.9228 40.2002 17.6911 28.4788 17.2285 40.5858 14.7328 37.8739 40.4716 38.3624 26.9624 55.0517 0.1936 7.5266 23.3149 28.7431 1.2344 4.2194 23.1579
temp: 298.150 k
press: 1.00000 atm
elementType: 8 7 7 6 6 6 6 6 6 6 6 6 6 6 6 6 6 6 6 6 6 6 1 1 1 1 1 1 1 1 1 1 1 1 1 1 1 1 1 1 1 1 1 1
symmnumber: 1
zpe: 970897.4 jmol-1
zpe.correction: 0.369795 hartree
zpe.thermalcorrener: 0.388641 hartree
zpe.thermalcorrenthalpy: 0.389585 hartree
zpe.thermalcorrgfe: 0.323924 hartree
zpe.sumelectzpe: -920.361807 hartree
zpe.sumelectthermal: -920.342961 hartree
zpe.sumelectthermalent: -920.342017 hartree
zpe.sumelectthermalfe: -920.407679 hartree
dipole: 0.6030 1.5139 -3.0869
dipole: 3.4906
quadrupole: -108.8388 -127.5002 -141.2461
quadrupole: -1.6248 -4.4493 4.6262
quadrupole: 17.0229 -1.6385 -15.3844 -1.6248 -4.4493 4.6262
hfenergy: -920.7316023 hartree
pointgroup: C01 [X(C19H22N2O1)]
dipole: 0.2602682 0.1457863 1.3405238 debye
polarizability: 255.6548227|5.9596023|186.1260017|-17.6268567|-0.1361481|188.3873835 unknown
InChI: InChI=1S/C19H22N2O/c1-2-19-10-5-12-21-13-9-15(18(19)21)14-6-3-4-7-16(14)20-17(22)8-11-19/h3-4,6-7,9,13,20H,2,5,8,10-12H2,1H3
charge 0 multiplicity 1
44 atoms
O  0.085912 -0.977778 -3.218775
N  2.01999 1.588067 -0.202544
N  -1.687199 -0.307082 -1.884393
C  1.573745 -0.803637 0.609464
C  3.111803 -0.766681 0.901901
C  1.102591 0.597934 0.204485
C  1.346108 -1.848245 -0.540597
C  0.824923 -1.227127 1.920169
C  3.914212 -0.003548 -0.171738
C  3.491358 1.472388 -0.180366
C  -0.1826 1.190495 0.143579
C  -0.109471 -2.046718 -1.025902
C  1.347182 2.770112 -0.503305
C  -0.015366 2.55415 -0.297573
C  1.200035 -2.60771 2.503919
C  -1.538445 0.627072 0.416072
C  -0.529527 -1.051179 -2.111941
C  -2.284126 -0.047286 -0.599019
C  -2.190322 0.886638 1.651436
C  -3.629014 -0.430068 -0.376312
C  -3.530284 0.502869 1.877451
C  -4.257452 -0.152688 0.856571
H  3.486111 -1.803782 0.98018
H  3.284586 -0.285863 1.887191
H  1.735466 -2.822628 -0.186545
H  1.950644 -1.571916 -1.424884
H  -0.26563 -1.202418 1.746312
H  1.023832 -0.445848 2.681223
H  4.997901 -0.064039 0.039856
H  3.750774 -0.449006 -1.169977
H  3.882051 1.977353 0.727013
H  3.897826 2.000643 -1.062029
H  -0.822727 -2.062327 -0.185645
H  -0.169576 -3.035982 -1.520138
H  1.885933 3.655682 -0.835771
H  -0.8167 3.273918 -0.456755
H  0.958092 -3.43233 1.808907
H  2.273856 -2.678895 2.75506
H  0.631995 -2.788142 3.435261
H  -1.984594 0.268216 -2.679569
H  -1.62977 1.412519 2.432361
H  -4.167703 -0.951454 -1.175393
H  -4.006232 0.720393 2.840052
H  -5.298886 -0.450572 1.020807
