program: Gaussian 09
title: 000160259
version: EM64L-G09RevD.01
frameworkgroup: C1[X(C4H6O3)]
method: RPBEPBE
basis: SDD
operation: Freq
keyword: #p
keyword: freq=noraman
keyword: PBEPBE/SDD
title: #p freq=noraman PBEPBE/SDD
converged: YES YES NO NO
title: Mulliken charges:
elementType: O O O C C C C H H H H H H
charge: -0.273700 -0.252719 -0.227734 0.070224 -0.366577 0.303748 -0.749763 0.263748 0.243583 0.231532 0.257982 0.251340 0.248335
chargesum: 0.00000
title: Mulliken charges with hydrogens summed into heavy atoms:
elementType: O O O C C C C
charge: -0.273700 -0.252719 -0.227734 0.333972 0.108538 0.303748 0.007894
polarizability: 6.88323592e+01 -3.38351550e+00 5.00000856e+01 -2.24058654e+00 1.37855708e-01 3.69174128e+01
1716.lowfreq: -12.0018 -5.0180 -3.5099 -0.0013 -0.0009 0.0003 45.0956 63.3549 108.9130
frequency: 44.9635 63.3470 108.9096 180.8950 340.6963 387.8858 456.8617 558.4365 599.8083 718.3472 764.9729 822.4776 923.7023 985.5838 1011.9443 1038.2877 1043.8571 1098.6276 1103.2386 1179.6204 1256.4888 1363.5562 1386.1846 1451.6883 1452.7944 1470.0802 1678.4194 3009.4391 3077.4883 3097.4624 3144.4481 3146.0132 3191.5622
redmass: 3.9115 1.2260 3.4758 3.6757 4.5118 3.2009 4.4013 3.2538 5.1289 8.1615 2.3976 4.9834 3.6594 1.7972 1.2642 2.0032 1.7078 1.4052 1.3843 3.2814 1.4958 1.7749 1.2826 1.0573 1.0468 1.2572 9.9344 1.0368 1.0527 1.0971 1.0931 1.1007 1.1195
irintensity: 3.8976 0.9565 5.7885 5.6089 1.3046 3.6598 22.5912 8.4348 3.7999 44.4673 20.1363 112.4602 62.6279 41.9161 1.0026 138.3457 24.7072 8.5802 14.5655 334.5205 13.5285 28.8706 46.3406 27.6750 19.9930 9.7200 205.4073 0.8071 17.8472 5.5179 9.8272 7.0496 18.1930
temp: 298.150 k
press: 1.00000 atm
elementType: 8 8 8 6 6 6 6 1 1 1 1 1 1
symmnumber: 1
zpe: 252161.4 jmol-1
zpe.correction: 0.096043 hartree
zpe.thermalcorrener: 0.103704 hartree
zpe.thermalcorrenthalpy: 0.104648 hartree
zpe.thermalcorrgfe: 0.062948 hartree
zpe.sumelectzpe: -381.093363 hartree
zpe.sumelectthermal: -381.085702 hartree
zpe.sumelectthermalent: -381.084758 hartree
zpe.sumelectthermalfe: -381.126458 hartree
dipole: -0.2519 -2.4548 -2.0180
dipole: 3.1878
quadrupole: -35.0509 -43.2445 -41.6968
quadrupole: 3.2210 -6.0397 -1.0155
quadrupole: 4.9465 -3.2471 -1.6994 3.2210 -6.0397 -1.0155
hfenergy: -381.1894057 hartree
pointgroup: C01 [X(C4H6O3)]
dipole: -0.0890983 1.1532058 0.4848968 debye
dipolederiv: -0.5637393 0.0630213 0.0291269 0.1606069 -0.4043399 -0.1313908 0.2116372 -0.1660823 -0.5736302 -1.9243626 -0.202472 0.0994609 -0.0668535 -0.5342189 0.0631875 -0.138668 0.0831489 -0.3219245 -0.6634252 0.0310181 -0.0373385 -0.3618392 -0.8754295 0.2134517 0.1045757 0.2322892 -0.3832399 1.2604534 -0.0602303 -0.0651237 -0.5816092 0.3652314 0.0566453 -0.032038 0.0250533 0.4342912 0.105477 -0.0622026 0.0744607 0.0450913 0.2433297 -0.0462826 0.1730375 0.0327395 0.2076 1.8824827 0.1486995 0.0587993 0.6139033 1.1872718 -0.3675437 -0.0688634 -0.3705023 0.3667236 -0.2537416 0.1393447 -0.0744821 0.2268058 -0.1833669 0.1047067 -0.1253936 0.1109957 -0.0366768 -0.0121282 -0.023382 0.0564611 0.0774694 0.0489346 0.0878737 0.0018851 0.0501398 0.0364056 0.1006104 0.0109011 -0.0446728 -0.034918 -0.0817052 0.03263 -0.0483585 0.0432093 0.0798001 -0.0551185 -0.0040738 -0.1177767 0.011616 0.0476485 0.0190914 -0.123684 -0.0052848 0.0332755 0.0887735 0.0154192 0.0496658 -0.0050458 0.1314105 0.0288402 0.0197398 0.0424725 -0.0431228 0.0936299 -0.0109343 -0.0378383 -0.0013267 -0.0035372 -0.0850944 0.001664 -0.103525 0.0766682 -0.0589115 -0.0451089 0.0092574 -0.0839004 0.0587713 0.023885 0.024466 0.0253462 0.1238301 unknown
polarizability: 68.8489098|3.849356|49.0168299|0.2986578|-3.6007329|37.8841177 unknown
InChI: InChI=1S/C4H6O3/c1-3(5)7-4-2-6-4/h4H,2H2,1H3
charge 0 multiplicity 1
13 atoms
O  1.975669 -0.460211 -0.812775
O  -0.097271 0.608306 0.00802
O  -1.405314 -1.257063 0.570792
C  1.1064 -0.115705 0.336703
C  2.374417 0.637578 0.1727
C  -1.331751 -0.093098 0.135773
C  -2.46322 0.793787 -0.321187
H  0.953724 -0.914931 1.069606
H  2.323998 1.65075 -0.242195
H  3.241075 0.40172 0.80038
H  -2.332467 1.04378 -1.388476
H  -2.455309 1.743683 0.240281
H  -3.422651 0.277804 -0.174922
