program: Gaussian 09
title: 000170772
version: EM64L-G09RevD.01
frameworkgroup: C1[X(C10H12N2O5)]
method: RPBEPBE
basis: SDD
operation: Freq
keyword: #p
keyword: freq=noraman
keyword: PBEPBE/SDD
title: #p freq=noraman PBEPBE/SDD
converged: YES YES NO NO
title: Mulliken charges:
elementType: O O O O O N N C C C C C C C C C C H H H H H H H H H H H H
charge: -0.316064 -0.446907 -0.235198 -0.201270 -0.204144 -0.653287 0.028983 -0.190941 0.494696 -0.404547 -0.315350 0.268462 -0.352375 -0.414036 0.380164 -0.350623 -0.349186 0.256922 0.241292 0.264553 0.230689 0.193201 0.262048 0.248657 0.292248 0.290524 0.319964 0.288858 0.372667
chargesum: 0.00000
title: Mulliken charges with hydrogens summed into heavy atoms:
elementType: O O O O O N N C C C C C C C C C C
charge: -0.316064 -0.074241 -0.235198 -0.201270 -0.204144 -0.044465 0.028983 0.065981 0.494696 0.101298 0.108540 0.268462 -0.090327 -0.165379 0.380164 -0.058375 -0.058662
polarizability: 2.19145879e+02 -8.59966852e+00 1.36743453e+02 -1.35517623e+01 -1.37282292e+01 8.62342005e+01
1716.lowfreq: -3.5367 -0.0010 -0.0007 -0.0006 4.1845 9.8355 15.6690 20.8770 33.8670
frequency: 15.6269 20.8455 33.8577 54.4185 66.2015 97.2159 132.0915 152.4408 178.2615 193.1540 201.2593 233.4292 275.3195 304.7585 324.6104 340.1900 379.3160 408.0587 420.3297 475.0342 484.9955 501.3198 503.0968 535.6451 603.0413 627.1201 634.0534 668.9283 700.2340 726.7704 762.2914 808.7078 840.0041 856.0149 861.2151 908.8646 949.8948 979.8578 988.7083 995.9310 1002.0952 1007.3446 1025.4107 1092.5096 1098.6018 1114.1294 1116.9655 1158.4621 1182.7135 1186.6169 1199.3021 1220.9710 1225.0655 1268.3891 1298.6132 1311.4704 1338.3573 1360.3879 1373.5527 1380.2738 1403.6132 1422.5614 1470.4449 1473.9260 1485.3268 1599.6798 1605.3166 1613.9178 1658.1025 2913.3402 2968.3821 3006.4822 3073.1287 3093.5527 3141.7073 3153.0337 3184.3903 3186.6337 3508.8775 3516.5690 3660.9106
redmass: 5.3898 6.1301 7.4101 7.0353 6.7732 6.2199 5.6139 3.1934 3.5495 1.4194 3.4009 4.6002 5.3100 3.8612 4.1927 3.6290 7.4461 2.8325 4.9601 1.9874 1.7130 1.3280 4.0783 4.2373 5.3534 6.8875 5.3413 4.7140 4.0772 4.0434 6.0343 5.7535 2.3411 1.4091 1.8946 4.7319 2.0393 1.5001 4.8251 1.5202 1.5801 2.7353 3.7110 3.2551 4.1410 1.2988 1.3882 1.1618 1.3503 2.3957 1.1336 3.8633 2.8993 1.2567 1.2901 1.2375 1.5512 1.9721 3.6593 1.3113 6.6990 3.1948 1.0843 1.1314 2.3325 6.5907 1.6241 5.5834 2.9198 1.0804 1.0697 1.0586 1.1052 1.0965 1.0909 1.0904 1.0946 1.0957 1.0652 1.0462 1.1003
irintensity: 0.7231 0.3836 0.7304 3.4250 0.2499 1.6095 3.7926 6.8723 1.5690 22.5257 1.8267 3.0402 1.8574 4.5723 9.6267 5.3163 9.8681 3.2605 10.6129 74.9540 160.2424 190.8032 24.7559 4.4119 8.4462 0.9012 1.8062 23.4310 6.2823 11.5956 33.3075 20.4249 47.7074 2.4647 26.5482 38.4903 15.3095 12.3839 43.0652 0.1242 0.4520 10.5906 9.8131 9.4253 491.8594 30.5307 83.5094 3.3731 66.2400 10.4823 11.2119 214.3704 26.3366 13.5697 0.6122 0.9031 3.9207 30.0228 101.7186 20.3567 2.3083 47.2567 5.8525 20.9969 1.6444 16.3168 241.5652 13.9844 80.8923 21.3518 71.0754 15.3558 14.8500 34.4280 8.4676 6.4576 0.1416 5.0605 49.3631 12.4053 24.7627
temp: 298.150 k
press: 1.00000 atm
elementType: 8 8 8 8 8 7 7 6 6 6 6 6 6 6 6 6 6 1 1 1 1 1 1 1 1 1 1 1 1
symmnumber: 1
zpe: 570285.2 jmol-1
zpe.correction: 0.217210 hartree
zpe.thermalcorrener: 0.234086 hartree
zpe.thermalcorrenthalpy: 0.235030 hartree
zpe.thermalcorrgfe: 0.169494 hartree
zpe.sumelectzpe: -872.516051 hartree
zpe.sumelectthermal: -872.499175 hartree
zpe.sumelectthermalent: -872.498231 hartree
zpe.sumelectthermalfe: -872.563767 hartree
dipole: 4.2998 -3.6252 0.3997
dipole: 5.6382
quadrupole: -119.4970 -102.8895 -100.1877
quadrupole: 9.0994 4.5805 -6.0952
quadrupole: -11.9723 4.6352 7.3370 9.0994 4.5805 -6.0952
hfenergy: -872.7332609 hartree
pointgroup: C01 [X(C10H12N2O5)]
dipole: -1.6085275 -1.5263731 -0.0587241 debye
polarizability: 219.1364587|11.0602344|140.2384495|-9.1755609|7.2172982|82.7486247 unknown
InChI: InChI=1S/C10H12N2O5/c11-9(5-13)10(14)17-6-7-1-3-8(4-2-7)12(15)16/h1-4,9,13H,5-6,11H2
charge 0 multiplicity 1
29 atoms
O  -1.897237 -0.639757 -0.360508
O  -2.381585 1.967287 -1.253532
O  -3.597881 -1.67174 0.858337
O  4.460687 2.105066 0.591931
O  5.348984 0.17071 -0.229118
N  -5.468115 0.146782 -0.038434
N  4.35596 0.885736 0.18245
C  -4.133444 0.251159 -0.61488
C  0.458404 -0.914221 0.202732
C  -0.90048 -1.574426 0.249321
C  -3.545233 1.692755 -0.41657
C  -3.235638 -0.79566 0.044809
C  0.630206 0.426033 0.639556
C  1.584129 -1.648625 -0.247333
C  3.00656 0.263624 0.18733
C  1.90335 1.024746 0.632515
C  2.868084 -1.068829 -0.254016
H  -4.097956 0.055631 -1.712509
H  -0.921586 -2.515663 -0.326378
H  -1.231814 -1.791491 1.28227
H  -4.31827 2.410334 -0.733688
H  -3.342129 1.857022 0.662888
H  -0.234161 1.000769 0.988012
H  1.458226 -2.679261 -0.597398
H  2.058206 2.055472 0.961466
H  3.749437 -1.617369 -0.595753
H  -5.629546 -0.653182 0.575613
H  -6.247834 0.41647 -0.634523
H  -1.730024 1.227726 -1.126691
