program: Gaussian 09
title: 000160248
version: EM64L-G09RevD.01
frameworkgroup: C1[X(C10H19N)]
method: RPBEPBE
basis: SDD
operation: Freq
keyword: #pfreq=noraman
keyword: PBEPBE/SDD
title: #p freq=noraman PBEPBE/SDD
converged: YES YES NO NO
title: Mulliken charges:
elementType: N C C C C C C C C C C H H H H H H H H H H H H H H H H H H H
charge: -0.533756 -0.550147 -0.460820 0.474889 -0.267876 -0.352685 0.374576 -0.837433 -0.466483 -0.785373 -0.794522 0.209282 0.203329 0.207014 0.207577 0.203532 0.211060 0.224722 0.238984 0.221245 0.215026 0.211392 0.214325 0.226647 0.215445 0.222835 0.222471 0.217567 0.261627 0.265549
chargesum: 0.00000
title: Mulliken charges with hydrogens summed into heavy atoms:
elementType: N C C C C C C C C C C
charge: -0.006580 -0.137535 -0.046229 0.474889 -0.064344 -0.141624 0.374576 -0.152482 -0.040065 -0.128956 -0.131650
polarizability: 1.26187913e+02 -3.70759519e+00 1.23320173e+02 1.25543919e+01 1.02867513e+00 1.04286230e+02
1716.lowfreq: -13.1782 -7.9112 -0.0006 -0.0004 0.0001 5.8141 14.6898 38.5877 43.7063
frequency: 12.6156 38.4385 43.2182 56.1177 109.5184 130.5774 141.2070 176.9885 182.7968 224.1054 241.7104 291.5647 303.2372 335.7629 376.7063 402.9006 427.5373 465.5669 489.2241 499.5719 551.5504 674.7689 740.3924 783.8518 821.6383 839.4464 878.7316 902.2623 925.6953 945.5123 987.7189 991.0509 997.4587 1031.7934 1039.6679 1057.3391 1076.4326 1081.4719 1116.2342 1124.7647 1160.5937 1197.6148 1226.3897 1232.9752 1306.1812 1314.0403 1325.8761 1329.3849 1362.9233 1369.8264 1386.8703 1392.5190 1397.9221 1452.1061 1454.6440 1456.2523 1460.3781 1466.5686 1472.1142 1473.4432 1474.9897 1482.4699 1642.9922 1677.4760 1696.2902 2946.1687 2955.6276 2961.4545 2962.9914 2965.2097 2991.5151 3016.1217 3026.1342 3029.6777 3033.2301 3042.2034 3048.8579 3065.7534 3068.4659 3078.3610 3090.2810 3094.6321 3426.0378 3552.0242
redmass: 3.5620 2.6592 2.8728 2.5458 2.0183 1.5037 1.0392 1.4398 1.8772 1.8028 1.3937 1.7351 2.2394 2.4616 2.2492 2.5012 2.5875 2.3131 2.4171 2.5255 2.2631 1.5080 2.0946 2.3683 1.3949 1.6141 1.5259 1.7266 1.8295 1.3858 1.6052 1.8306 1.6078 1.7166 1.6032 3.7076 1.7277 1.6615 1.9452 1.6201 1.5577 1.2367 1.9368 1.9019 1.3909 1.2245 1.3498 1.3239 1.4478 1.3843 1.3101 1.2805 1.2270 1.0798 1.0781 1.0575 1.0824 1.0569 1.0462 1.0655 1.0782 1.0723 1.0852 6.6487 6.5310 1.0626 1.0372 1.0512 1.0465 1.0462 1.0632 1.0969 1.0970 1.0964 1.0966 1.0926 1.0933 1.0922 1.0937 1.0967 1.0957 1.0950 1.0448 1.0965
irintensity: 0.0195 0.3852 0.2960 0.6462 0.3726 0.3446 0.2170 2.3695 4.1165 3.7279 37.5160 19.0825 1.1522 1.7364 0.3601 6.0361 7.4945 3.8807 5.2278 0.1985 8.6829 304.5385 23.2362 0.1233 5.3875 12.1440 8.7477 15.4857 6.6286 0.4145 7.9095 4.8926 0.1424 10.6022 3.0852 12.3900 6.6828 3.3773 12.2601 2.1939 3.2773 3.7104 5.4359 3.2153 0.5669 0.1746 4.8552 0.8922 0.8328 0.9057 22.8740 23.7990 10.6283 2.8500 8.0160 3.0265 6.0767 12.6639 18.9399 32.7326 11.0983 4.1718 25.7824 4.9805 3.4340 19.1885 36.4290 95.8716 13.7532 63.0943 50.6197 8.5093 6.5751 56.9479 27.9878 25.1439 3.2993 2.6232 67.6363 55.8663 39.4253 32.0658 2.8407 0.2321
temp: 298.150 k
press: 1.00000 atm
elementType: 7 6 6 6 6 6 6 6 6 6 6 1 1 1 1 1 1 1 1 1 1 1 1 1 1 1 1 1 1 1
symmnumber: 1
zpe: 700322.2 jmol-1
zpe.correction: 0.266739 hartree
zpe.thermalcorrener: 0.281486 hartree
zpe.thermalcorrenthalpy: 0.282430 hartree
zpe.thermalcorrgfe: 0.223157 hartree
zpe.sumelectzpe: -446.273761 hartree
zpe.sumelectthermal: -446.259013 hartree
zpe.sumelectthermalent: -446.258069 hartree
zpe.sumelectthermalfe: -446.317343 hartree
dipole: 1.4646 -0.6723 -0.5705
dipole: 1.7096
quadrupole: -75.3248 -70.6918 -67.5454
quadrupole: 4.4270 5.2063 -3.5806
quadrupole: -4.1375 0.4956 3.6419 4.4270 5.2063 -3.5806
hfenergy: -446.5404993 hartree
pointgroup: C01 [X(C10H19N1)]
dipole: -0.5775274 -0.3176155 0.1340255 debye
polarizability: 121.9479761|3.078451|123.841565|15.1024013|1.325585|108.0047754 unknown
InChI: InChI=1S/C10H19N/c1-9(2)5-4-6-10(3)7-8-11/h5,7H,4,6,8,11H2,1-3H3
charge 0 multiplicity 1
30 atoms
N  2.744409 2.420476 0.422663
C  0.400134 -1.810113 0.869631
C  -1.090673 -1.696051 0.418701
C  1.369479 -0.917331 0.099014
C  -1.658326 -0.303997 0.610313
C  2.143187 -0.007495 0.762267
C  -2.372067 0.450155 -0.274966
C  1.396692 -1.133037 -1.404599
C  3.124471 0.999659 0.181039
C  -2.863939 1.839222 0.104474
C  -2.750074 0.010722 -1.67963
H  0.465059 -1.57637 1.9505
H  0.705956 -2.872149 0.753104
H  -1.674674 -2.420306 1.026106
H  -1.190635 -2.028734 -0.630346
H  -1.454368 0.136503 1.600099
H  2.027882 0.056769 1.857408
H  2.196754 -0.5666 -1.907549
H  0.433812 -0.831494 -1.862256
H  1.541902 -2.205648 -1.641592
H  4.12888 0.853949 0.62431
H  3.242463 0.860922 -0.907682
H  -2.460235 2.606951 -0.586138
H  -2.56751 2.112268 1.132302
H  -3.96856 1.904674 0.037045
H  -2.34877 -0.980522 -1.946587
H  -3.852189 -0.03203 -1.790582
H  -2.387267 0.742313 -2.429039
H  2.82908 2.695015 1.408895
H  1.803026 2.634581 0.070693
