program: Gaussian 09
title: 000160247
version: EM64L-G09RevD.01
frameworkgroup: C1[X(C20H16ClNO3)]
method: RPBEPBE
basis: SDD
operation: Freq
keyword: #p
keyword: freq=noraman
keyword: PBEPBE/SDD
title: #p freq=noraman PBEPBE/SDD
converged: YES YES NO NO
title: Mulliken charges:
elementType: Cl O O O N C C C C C C C C C C C C C C C C C C C C H H H H H H H H H H H H H H H H
charge: 0.006901 -0.368714 -0.265859 -0.147506 -0.493042 0.396104 0.433186 0.061065 -0.560797 0.312918 -0.537553 0.113925 0.321085 -0.413353 -0.412997 0.266861 -0.237157 -0.234093 -0.339159 -0.383536 -0.855460 -0.235863 -0.247990 0.323445 -0.703970 0.289955 0.266261 0.252353 0.247853 0.383299 0.234493 0.233742 0.308912 0.228166 0.224477 0.240752 0.245842 0.228802 0.228228 0.301567 0.286857
chargesum: 0.00000
title: Mulliken charges with hydrogens summed into heavy atoms:
elementType: Cl O O O N C C C C C C C C C C C C C C C C C C C C
charge: 0.006901 -0.368714 -0.265859 -0.147506 -0.109743 0.396104 0.433186 0.061065 -0.270843 0.312918 -0.271292 0.113925 0.321085 -0.160999 -0.165144 0.266861 -0.002664 -0.000350 -0.030247 -0.155370 -0.144389 -0.007061 -0.019762 0.323445 -0.115545
polarizability: 4.25190370e+02 7.73695778e+00 2.50809734e+02 -2.56449208e+00 3.10058281e+01 1.36680637e+02
1716.lowfreq: -6.6635 -5.0456 -3.1406 -0.0020 -0.0014 0.0010 14.1743 25.4526 33.4536
frequency: 14.1327 25.4353 33.4033 39.3932 55.0804 61.3930 69.8800 82.1331 100.2841 141.5935 153.4178 168.5348 179.5202 194.3709 211.4411 240.4921 245.5540 286.9986 298.1038 308.0016 326.2067 363.8153 415.9889 424.5117 444.5287 469.7864 480.7435 502.9227 519.8646 533.3463 546.8363 550.6245 571.6037 605.0402 616.9297 634.8778 678.4530 689.7283 701.2090 727.7069 739.6885 749.4328 761.8503 766.2899 769.0318 780.8387 793.7692 831.5996 853.5192 862.9037 875.3627 879.4633 905.6448 909.3276 917.4463 947.3743 953.5480 975.8689 979.9715 994.2420 997.3763 1020.4794 1025.1011 1040.5201 1046.6054 1049.4306 1107.8294 1138.3134 1143.9056 1155.4252 1174.5222 1175.5574 1196.5507 1203.0223 1236.7353 1256.3216 1274.3339 1277.2763 1278.5504 1298.1596 1324.0449 1375.2474 1395.3340 1402.4687 1421.2702 1426.8198 1437.2268 1438.5515 1451.9493 1462.4297 1477.4109 1484.9914 1506.3210 1523.3385 1569.7516 1589.6091 1596.0317 1610.8808 1618.1958 1640.8512 1709.1008 2963.2322 3032.8114 3050.9288 3088.6348 3122.0300 3127.8685 3131.6192 3133.9836 3138.2287 3148.1081 3149.4224 3161.4714 3166.3959 3167.3099 3198.9919 3487.7981
redmass: 6.1319 7.1152 6.2836 6.5780 6.2225 3.3028 5.1891 5.2801 4.9446 5.7248 4.0812 1.1551 4.6479 4.7778 7.4325 6.6813 4.6282 5.4656 4.4784 7.4797 5.1433 6.8452 3.4722 3.8564 2.9841 7.4231 2.6208 6.1929 3.4724 3.7722 3.5733 5.9235 5.8825 6.7713 6.6802 6.1376 6.1438 5.0125 1.4298 2.5875 5.6511 3.9648 2.3699 1.8517 1.4922 2.5437 4.8873 5.1963 3.3240 1.9887 3.4654 1.3618 3.5279 2.0289 1.8027 1.5550 1.3763 1.4446 1.5787 1.3160 1.3545 3.1251 3.6149 1.5706 3.6043 2.2826 2.1770 1.6295 1.8859 1.1186 1.0911 1.0778 2.1476 2.1601 1.5000 3.3114 2.1863 1.7693 1.3635 1.6995 2.2405 5.9270 1.2741 5.3707 1.1044 3.3120 3.3326 2.2408 2.8727 1.8388 1.0494 1.5202 3.9909 2.1444 6.3295 8.0265 5.3813 4.5068 4.8209 6.4696 11.3190 1.0390 1.0963 1.0577 1.0960 1.0874 1.0858 1.1066 1.0892 1.0901 1.0927 1.0944 1.0986 1.0971 1.0961 1.0947 1.0771
irintensity: 1.0843 1.4413 0.1999 1.5476 3.3362 4.4959 2.3081 3.8604 0.2629 0.1029 0.9062 0.6390 0.6322 2.4584 3.6987 1.0261 1.3188 3.0107 7.6252 4.6975 0.1163 3.8227 0.6325 0.6989 8.2121 5.3733 18.2508 22.0928 2.0056 2.4522 3.2787 5.2956 7.8023 3.3907 1.2485 8.7744 22.9065 26.2768 58.8903 0.5702 11.8342 2.0258 19.7294 59.7285 114.2671 2.5781 4.9291 10.6815 26.1317 5.0044 61.9245 9.7196 8.3298 37.3387 8.3356 6.6773 3.9997 15.5250 3.8533 1.8799 0.2812 62.7916 60.2872 40.2086 337.5920 72.8948 6.9108 8.8449 38.9781 6.0499 0.3338 0.6192 43.9384 87.0658 3.6120 13.4421 51.6530 0.9942 9.2523 52.1083 26.7283 69.2369 18.8612 12.8550 19.3010 12.0891 7.4549 58.1630 32.7444 99.5821 12.5019 52.8550 5.4185 418.3665 11.1128 64.9956 60.6933 82.0976 4.2079 18.4978 139.7035 36.2394 29.8242 14.3859 20.9349 9.8231 1.3367 1.2819 0.2939 17.5423 8.8530 14.6261 37.4130 26.6872 12.8058 8.7840 84.5495
temp: 298.150 k
press: 1.00000 atm
elementType: 17 8 8 8 7 6 6 6 6 6 6 6 6 6 6 6 6 6 6 6 6 6 6 6 6 1 1 1 1 1 1 1 1 1 1 1 1 1 1 1 1
symmnumber: 1
zpe: 812191.0 jmol-1
zpe.correction: 0.309347 hartree
zpe.thermalcorrener: 0.331519 hartree
zpe.thermalcorrenthalpy: 0.332464 hartree
zpe.thermalcorrgfe: 0.254669 hartree
zpe.sumelectzpe: -1510.498197 hartree
zpe.sumelectthermal: -1510.476025 hartree
zpe.sumelectthermalent: -1510.475081 hartree
zpe.sumelectthermalfe: -1510.552876 hartree
dipole: -0.5837 0.4812 3.4941
dipole: 3.5750
quadrupole: -123.1776 -163.7913 -155.7706
quadrupole: 7.6898 -0.4568 8.2125
quadrupole: 24.4022 -16.2115 -8.1908 7.6898 -0.4568 8.2125
hfenergy: -1510.8075443 hartree
pointgroup: C01 [X(C20H16Cl1N1O3)]
dipole: 0.2710059 0.1656507 1.3701848 debye
polarizability: 425.1095097|4.5495963|227.9135899|-7.730513|-55.296408|159.6576414 unknown
InChI: InChI=1S/C20H16ClNO3/c1-13-6-2-5-9-17(13)22-20(24)16-10-14-7-3-4-8-15(14)11-18(16)25-19(23)12-21/h2-11,22H,12H2,1H3
charge 0 multiplicity 1
41 atoms
Cl -1.293607 -5.263251 0.909214
O  0.059978 -1.458528 0.791843
O  -0.588224 1.990506 -1.629171
O  0.981311 -3.43135 -0.126329
N  -1.573528 0.660377 0.038023
C  3.31459 1.057798 -0.356674
C  3.573704 -0.165918 0.372808
C  0.875606 0.600293 -0.302077
C  1.966158 1.401842 -0.671874
C  1.170611 -0.61971 0.40182
C  2.466708 -0.995271 0.737402
C  -0.490208 1.126169 -0.702948
C  -2.942891 1.045571 -0.070923
C  4.419567 1.890228 -0.736891
C  4.925237 -0.515144 0.697366
C  -3.8332 0.619263 0.967747
C  5.726815 1.527008 -0.407884
C  5.980598 0.316194 0.31479
C  -3.431377 1.817829 -1.159348
C  -5.199172 0.968756 0.86757
C  -3.333798 -0.170698 2.166544
C  -4.800004 2.1519 -1.225349
C  -5.693154 1.727431 -0.217587
C  0.060004 -2.848013 0.450947
C  -1.277106 -3.408118 0.916227
H  1.744352 2.317373 -1.231102
H  2.648126 -1.936142 1.264206
H  4.221139 2.814876 -1.290801
H  5.120166 -1.444461 1.244721
H  -1.349246 -0.046587 0.744663
H  6.566562 2.165585 -0.701745
H  7.011851 0.044071 0.564259
H  -2.73258 2.152354 -1.926974
H  -5.884242 0.64593 1.660668
H  -2.947714 -1.17013 1.882102
H  -2.521918 0.357681 2.703534
H  -4.151067 -0.337964 2.887142
H  -5.16408 2.746913 -2.070085
H  -6.755969 1.986582 -0.269261
H  -2.077591 -3.073755 0.236819
H  -1.493904 -3.075293 1.941507
