program: Gaussian 09
title: 000160232
version: EM64L-G09RevD.01
frameworkgroup: C1[X(C14H16N4O4)]
method: RPBEPBE
basis: SDD
operation: Freq
keyword: #p
keyword: freq=noraman
keyword: PBEPBE/SDD
title: #p freq=noraman PBEPBE/SDD
converged: YES YES NO NO
title: Mulliken charges:
elementType: O O O O N N N N C C C C C C C C C C C C C C H H H H H H H H H H H H H H H H
charge: -0.441424 -0.224458 -0.382089 -0.287831 -0.105274 -0.092676 -0.137637 -0.050054 -0.129220 -0.505813 -0.368964 -0.337249 0.019711 0.102106 0.159855 -0.393144 -0.333672 -0.303041 0.087724 0.117501 -0.667988 0.105287 0.228969 0.238310 0.225249 0.269791 0.227176 0.262056 0.242583 0.340148 0.286996 0.253908 0.219113 0.293740 0.229124 0.250129 0.223849 0.377212
chargesum: 0.00000
title: Mulliken charges with hydrogens summed into heavy atoms:
elementType: O O O O N N N N C C C C C C C C C C C C C C
charge: -0.101276 -0.224458 -0.004878 -0.287831 -0.105274 -0.092676 -0.137637 -0.050054 0.099748 -0.042254 0.128003 0.167390 0.019711 0.102106 0.159855 -0.106148 0.139349 -0.009301 0.087724 0.117501 0.035113 0.105287
polarizability: 3.31700028e+02 4.94101181e+00 1.98875266e+02 -4.38318850e+00 -9.36957754e+00 1.06322973e+02
1716.lowfreq: -6.5220 -0.0008 -0.0007 -0.0004 3.4890 8.4062 22.8634 30.4885 45.9820
frequency: 22.3301 30.4247 45.9309 50.0258 60.1595 78.1187 89.6862 105.1405 160.4326 168.7632 182.7989 210.1573 233.9813 237.5164 238.7366 269.8195 292.9582 306.4394 320.7309 364.1710 374.2995 390.2235 397.2818 416.8085 435.3156 480.9497 482.7418 518.8182 535.6490 591.6217 599.2966 642.8978 667.1065 679.9409 693.1580 715.6133 750.1830 765.1946 766.3079 789.8400 810.4941 823.2105 827.9914 859.5425 871.4847 916.6160 946.5467 956.3783 963.0653 977.0956 987.0940 1009.0104 1035.1703 1054.7251 1068.5683 1089.6782 1092.6149 1126.0240 1136.3292 1150.2953 1162.0518 1185.6059 1198.4180 1212.2225 1236.6350 1248.8317 1255.0823 1276.7801 1279.1436 1312.7512 1326.5432 1333.3922 1341.5640 1344.3522 1352.7438 1370.5698 1374.6698 1377.2529 1393.0057 1438.6929 1456.9477 1463.7644 1466.9749 1469.6707 1472.3238 1484.4800 1485.9112 1543.6984 1556.5814 1577.8711 1590.2553 1625.6571 2991.1629 2992.4478 3002.1155 3005.6147 3018.0048 3029.4035 3072.5824 3077.2482 3083.8958 3093.5487 3095.8139 3111.9331 3151.7077 3152.0604 3492.4184 3563.4998
redmass: 5.7294 9.1254 7.1110 3.7756 2.7965 5.8909 4.4393 4.5860 4.2994 3.2902 5.0605 1.3183 4.1416 4.5027 5.3859 2.7196 3.9517 1.2391 3.9257 6.2253 4.1639 3.1038 3.2115 4.1133 4.1978 4.8433 4.8788 5.3658 3.9696 4.9132 1.3888 4.5293 3.7704 4.7576 3.2675 8.0844 6.9274 3.9308 8.6178 1.4085 7.5288 3.3371 3.4921 3.1246 4.0145 1.9518 2.4708 2.2406 1.4191 1.4619 1.9257 3.4141 2.8021 2.3672 2.4580 1.9767 1.9927 2.7517 1.8240 1.7154 1.3412 1.4402 1.9105 1.2920 2.6112 2.3143 2.5744 1.6366 1.3754 1.3527 1.9675 1.7026 1.5816 2.8498 1.5176 2.0502 3.4862 1.8892 1.2149 3.6185 1.0981 1.1194 4.4924 1.0734 1.2156 1.0561 1.1052 7.4899 10.1593 7.9273 8.2713 7.7802 1.0746 1.0359 1.0673 1.0645 1.0728 1.0623 1.1003 1.1006 1.1008 1.1012 1.0986 1.1038 1.0929 1.0929 1.0635 1.0660
irintensity: 1.3580 2.2766 0.1682 2.1364 1.1074 0.2933 1.3835 0.0822 0.9541 0.5114 4.3947 2.0355 3.5025 2.9313 6.2503 11.4881 11.7137 146.2023 0.5240 9.2514 8.0338 2.6906 1.3486 6.6592 4.9653 25.0450 6.9703 10.1024 12.2205 87.3637 96.1493 12.1554 14.4807 34.9952 3.4542 20.8631 3.2270 7.0210 4.0094 7.5701 27.5612 5.6825 11.3806 21.1409 18.4804 7.6806 7.5872 30.8414 13.2735 6.4600 7.8844 58.4732 113.8805 72.8531 176.6584 23.1079 29.3560 57.5404 32.9249 36.0847 3.2450 27.2242 20.0645 14.4120 45.4981 6.1222 25.8187 60.6077 14.1315 4.0958 21.9699 33.6075 69.9419 41.6182 8.5051 91.1902 8.3154 77.9368 21.1931 294.5246 44.7506 63.3341 382.1568 42.3531 66.6611 6.6777 15.7879 90.0510 232.2889 1208.2066 1.3682 456.2289 3.3778 19.7009 54.3145 11.6342 102.9943 28.3659 7.7252 33.4977 12.7248 21.6077 26.2075 16.2666 1.4618 0.6079 34.6543 4.5912
temp: 298.150 k
press: 1.00000 atm
elementType: 8 8 8 8 7 7 7 7 6 6 6 6 6 6 6 6 6 6 6 6 6 6 1 1 1 1 1 1 1 1 1 1 1 1 1 1 1 1
symmnumber: 1
zpe: 771659.6 jmol-1
zpe.correction: 0.293910 hartree
zpe.thermalcorrener: 0.314030 hartree
zpe.thermalcorrenthalpy: 0.314974 hartree
zpe.thermalcorrgfe: 0.243417 hartree
zpe.sumelectzpe: -1061.399591 hartree
zpe.sumelectthermal: -1061.379471 hartree
zpe.sumelectthermalent: -1061.378527 hartree
zpe.sumelectthermalfe: -1061.450083 hartree
dipole: 8.0714 4.1616 -1.9132
dipole: 9.2804
quadrupole: -108.1339 -132.1596 -127.9725
quadrupole: -8.2395 -4.3465 -1.0478
quadrupole: 14.6215 -9.4043 -5.2172 -8.2395 -4.3465 -1.0478
hfenergy: -1061.6935006 hartree
pointgroup: C01 [X(C14H16N4O4)]
dipole: -3.170591 1.6585485 0.7265188 debye
polarizability: 331.6801763|-6.1227755|198.8418561|-1.7255196|9.9253868|106.3762352 unknown
InChI: InChI=1S/C14H16N4O4/c1-2-17-7-10(13(21)22)11(20)9-5-15-14(16-12(9)17)18-4-3-8(19)6-18/h5,7-8,19,21H,2-4,6H2,1H3
charge 0 multiplicity 1
38 atoms
O  -5.456502 0.945131 -1.248597
O  2.896895 -2.460726 -0.304364
O  5.386507 -1.210187 -0.122411
O  5.413578 1.074951 0.231342
N  -3.077357 -0.403971 0.189967
N  -0.916444 0.494022 0.293114
N  1.284577 1.360032 0.390044
N  -1.298681 -1.908749 -0.105969
C  -5.195391 0.676185 0.17953
C  -5.375638 -0.823262 0.526335
C  -3.690633 0.929649 0.383184
C  -4.079899 -1.480865 0.000233
C  -1.731502 -0.603356 0.124215
C  0.419948 0.25946 0.221034
C  0.986238 -1.02893 -0.009822
C  0.039082 -2.081582 -0.162498
C  0.729042 2.730682 0.579723
C  2.643736 1.163923 0.316777
C  2.449103 -1.28871 -0.091531
C  3.266491 -0.062835 0.097426
C  0.443604 3.433531 -0.761052
C  4.749639 0.008928 0.078488
H  -5.816512 1.338289 0.814329
H  -6.284312 -1.259011 0.075977
H  -5.445353 -0.941043 1.623948
H  -3.314372 1.654334 -0.358352
H  -3.466363 1.319725 1.393885
H  -3.778472 -2.385518 0.550988
H  -4.156348 -1.742339 -1.071987
H  -6.391896 0.69713 -1.461153
H  0.411155 -3.096324 -0.339161
H  -0.20254 2.626019 1.157757
H  1.459312 3.301525 1.179762
H  3.271793 2.051359 0.448081
H  1.360667 3.53132 -1.368763
H  -0.306651 2.870489 -1.341233
H  0.045513 4.447178 -0.574216
H  6.369687 -1.042854 -0.116832
